{"text_format":"1","workbook":"xlsx","n_sheets":5,"sheets":["Window Film","Ref Tables","Irradiance","Help","Change Log"],"not_rendered":{"charts":0,"images":2,"macros":1,"external_links":1,"defined_names":10,"comments":1,"pivot_tables":0},"unopened":[],"bounds":{"document_bytes":16777216,"sheet_cells":100000,"rows_first":2000,"rows_last":500,"rows_between":2000,"halvings":0,"cell_chars":16384,"cell_head_chars":4096},"cells_cut":0,"cells_raw":0,"read":"whole","date_system":"1900"}

{"sheet":"Window Film","index":0,"n_rows":52,"n_cols":49,"rows_kept":52,"cut":false,"hidden":false,"merged":[[7,1,7,2],[14,1,14,2],[15,1,15,2],[14,3,14,8],[13,3,13,5],[12,7,12,8],[12,1,12,6],[13,1,13,2],[13,6,13,8],[8,1,8,2],[11,3,11,4],[9,1,9,2],[10,1,10,2],[11,1,11,2],[8,3,8,4],[10,3,10,4],[1,46,1,47],[5,17,5,18],[7,16,7,18],[5,24,6,24],[2,42,2,44],[1,42,1,44],[2,24,4,24],[4,16,4,18],[6,17,6,18],[2,46,2,47],[2,25,9,26],[2,27,4,29],[7,28,7,29],[5,27,6,29],[7,27,9,27],[11,36,11,39],[12,38,12,39],[17,35,17,37],[16,35,16,37],[12,36,12,37],[43,31,43,32],[14,10,14,11],[18,35,18,37],[15,35,15,38],[17,31,17,32],[16,31,16,32],[20,15,21,18],[19,12,19,13],[19,10,19,11],[19,15,19,16],[17,10,17,11],[17,12,17,13],[17,1,17,8],[18,17,18,18],[16,15,16,17],[16,3,16,4],[15,3,15,8],[15,12,15,13],[15,10,15,11],[18,15,18,16],[15,17,15,18],[18,1,19,8],[18,10,18,11],[17,15,17,18],[18,12,18,13],[16,1,16,2],[19,17,19,18],[14,14,18,14],[10,13,10,14],[10,16,10,17],[1,3,2,16],[8,10,9,10],[7,11,7,12],[9,3,9,5],[9,13,9,18],[7,3,7,8],[11,10,12,10],[3,17,3,18],[8,14,8,15],[8,12,8,13],[9,7,9,8],[8,17,8,18],[10,5,10,7],[11,5,11,8],[10,10,10,12],[7,13,7,14],[8,11,9,11],[3,4,3,15],[6,14,6,15],[6,3,6,8],[5,3,5,8],[4,1,4,6],[13,17,13,18],[13,10,13,16],[15,15,15,16],[14,12,14,13],[16,10,16,11],[16,12,16,13],[14,17,14,18],[5,1,5,2],[6,1,6,2],[6,11,6,13],[5,11,5,14],[4,7,4,8]]}
[{"$f":"IF(G9=\"\",\"\",IF(G9=\"ID\",2,IF(OR(G9=\"WA\",G9=\"CA\"),1,3)))","v":""}]
[null,null,null,"Window Film Calculator ",null,null,null,null,null,null,null,null,null,null,null,null,null,null,"Version:",null,null,null,null,null,null,null,null,null,null,null,null,null,null,null,null,null,null,null,null,null,null,"Glazing","Glass Tint",null,null,"Low E","Film"]
[null,null,null,null,null,null,null,null,null,null,null,null,null,null,null,null,null,null,"071116.1",null,null,null,1,"ID","RMP","Rate Lookups",null,"Simplified Rate Table For FinAnswer Express",null,null,"Ashrea 1997 Fundamentals","N","NE","E","SE","S","SW","W","NW","ADLH",null,{"$f":"IF($R$6=\"\",\"\",$R$6)","v":""},{"$f":"IF(OR($AP$3=\"\",$R$7=\"\"),\"\",VLOOKUP($R$7,$AR$4:$AS$10,2,0))","v":""},null,null,{"$f":"IF(OR($Q$8=\"\",$AQ$3=\"\"),\"\",$Q$8)","v":""},{"$f":"IF(#REF!=\"\",\"\",VLOOKUP(#REF!,$AU$4:$AV$12,2,0))","v":{"$error":"#REF!"}}]
[null,"Date",null,null,{"$f":"IF(AND(G9=\"\",C4=\"\"),\"Please enter the date the window film was purchased.\",IF(InstallState=\"\",\"Please enter the state where the window film was installed.\",IF(C4<VLOOKUP(InstallState,TariffDates,3,FALSE),\"This tool calculates incentives for window film purchased on or after \"&VLOOKUP(InstallState,TariffDates,2,FALSE)&\". Please contact us for assistance with installations prior to \"&VLOOKUP(InstallState,TariffDates,2,FALSE)&\".\",\"Calculations are in accordance with Tariff 140\"&\" effective \"&VLOOKUP(G9,TariffDates,2,FALSE))))","v":"Please enter the date the window film was purchased."},null,null,null,null,null,null,null,null,null,null,null,"Project #",null,null,null,null,null,2,"UT",null,null,null,null,null,null,"Summer Irradiance (btu/hr/ft^2)",{"$f":"OFFSET(Irradiance!$D$4,MATCH($L$6,Irradiance!$C$4:$C$14,0)-1,MATCH('Window Film'!AF$3,Irradiance!$D$2:$AA$2,0)-1)","v":{"$error":"#N/A"}},{"$f":"OFFSET(Irradiance!$D$4,MATCH($L$6,Irradiance!$C$4:$C$14,0)-1,MATCH('Window Film'!AG$3,Irradiance!$D$2:$AA$2,0)-1)","v":{"$error":"#N/A"}},{"$f":"OFFSET(Irradiance!$D$4,MATCH($L$6,Irradiance!$C$4:$C$14,0)-1,MATCH('Window Film'!AH$3,Irradiance!$D$2:$AA$2,0)-1)","v":{"$error":"#N/A"}},{"$f":"OFFSET(Irradiance!$D$4,MATCH($L$6,Irradiance!$C$4:$C$14,0)-1,MATCH('Window Film'!AI$3,Irradiance!$D$2:$AA$2,0)-1)","v":{"$error":"#N/A"}},{"$f":"OFFSET(Irradiance!$D$4,MATCH($L$6,Irradiance!$C$4:$C$14,0)-1,MATCH('Window Film'!AJ$3,Irradiance!$D$2:$AA$2,0)-1)","v":{"$error":"#N/A"}},{"$f":"OFFSET(Irradiance!$D$4,MATCH($L$6,Irradiance!$C$4:$C$14,0)-1,MATCH('Window Film'!AK$3,Irradiance!$D$2:$AA$2,0)-1)","v":{"$error":"#N/A"}},{"$f":"OFFSET(Irradiance!$D$4,MATCH($L$6,Irradiance!$C$4:$C$14,0)-1,MATCH('Window Film'!AL$3,Irradiance!$D$2:$AA$2,0)-1)","v":{"$error":"#N/A"}},{"$f":"OFFSET(Irradiance!$D$4,MATCH($L$6,Irradiance!$C$4:$C$14,0)-1,MATCH('Window Film'!AM$3,Irradiance!$D$2:$AA$2,0)-1)","v":{"$error":"#N/A"}},{"$f":"OFFSET(Irradiance!$D$4,MATCH($L$6,Irradiance!$C$4:$C$14,0)-1,MATCH('Window Film'!AN$3,Irradiance!$D$2:$AB$2,0)-1)","v":{"$error":"#N/A"}},1,"Single 1/8\" Glass",{"$f":"IF(ISERROR(VLOOKUP(SMALL('Ref Tables'!$G$3:$G$75,'Window Film'!$AO4),'Ref Tables'!$G$3:$H$75,2,0)),\"\",VLOOKUP(SMALL('Ref Tables'!$G$3:$G$75,'Window Film'!$AO4),'Ref Tables'!$G$3:$H$75,2,0))","v":"CLR"},{"$f":"IF(AQ4=\"\",\"\",VLOOKUP(AQ4,'Ref Tables'!$C$1:$D$7,2,0))","v":"Clear"},{"$f":"AQ4","v":"CLR"},{"$f":"IF(ISERROR(VLOOKUP(SMALL('Ref Tables'!$I$3:$I$75,'Window Film'!AO4),'Ref Tables'!$I$3:$J$75,2,0)),\"\",VLOOKUP(SMALL('Ref Tables'!$I$3:$I$75,'Window Film'!AO4),'Ref Tables'!$I$3:$J$75,2,0))","v":"Uncoated"},"Stainless Steel 8%",{"$f":"'Ref Tables'!#REF!","v":{"$error":"#REF!"}},"AC"]
[null,"Project/Customer Information",null,null,null,null,null,{"$f":"IF(OR(G9=\"\",I11=\"\"),FALSE,\"\")","v":false},null,null,"Project Information",null,null,null,null,null,{"$f":"IF(AF7=0,\"Invalid Window Type\",\"\")","v":"Invalid Window Type"},null,null,null,null,null,3,"WY",null,null,null,null,null,null,"Winter Irradiance (btu/hr/ft^2)",{"$f":"OFFSET(Irradiance!$D$15,MATCH($L$6,Irradiance!$C$15:$C$25,0)-1,MATCH('Window Film'!AF$3,Irradiance!$D$2:$AA$2,0)-1)","v":{"$error":"#N/A"}},{"$f":"OFFSET(Irradiance!$D$15,MATCH($L$6,Irradiance!$C$15:$C$25,0)-1,MATCH('Window Film'!AG$3,Irradiance!$D$2:$AA$2,0)-1)","v":{"$error":"#N/A"}},{"$f":"OFFSET(Irradiance!$D$15,MATCH($L$6,Irradiance!$C$15:$C$25,0)-1,MATCH('Window Film'!AH$3,Irradiance!$D$2:$AA$2,0)-1)","v":{"$error":"#N/A"}},{"$f":"OFFSET(Irradiance!$D$15,MATCH($L$6,Irradiance!$C$15:$C$25,0)-1,MATCH('Window Film'!AI$3,Irradiance!$D$2:$AA$2,0)-1)","v":{"$error":"#N/A"}},{"$f":"OFFSET(Irradiance!$D$15,MATCH($L$6,Irradiance!$C$15:$C$25,0)-1,MATCH('Window Film'!AJ$3,Irradiance!$D$2:$AA$2,0)-1)","v":{"$error":"#N/A"}},{"$f":"OFFSET(Irradiance!$D$15,MATCH($L$6,Irradiance!$C$15:$C$25,0)-1,MATCH('Window Film'!AK$3,Irradiance!$D$2:$AA$2,0)-1)","v":{"$error":"#N/A"}},{"$f":"OFFSET(Irradiance!$D$15,MATCH($L$6,Irradiance!$C$15:$C$25,0)-1,MATCH('Window Film'!AL$3,Irradiance!$D$2:$AA$2,0)-1)","v":{"$error":"#N/A"}},{"$f":"OFFSET(Irradiance!$D$15,MATCH($L$6,Irradiance!$C$15:$C$25,0)-1,MATCH('Window Film'!AM$3,Irradiance!$D$2:$AA$2,0)-1)","v":{"$error":"#N/A"}},{"$f":"OFFSET(Irradiance!$D$15,MATCH($L$6,Irradiance!$C$15:$C$25,0)-1,MATCH('Window Film'!AN$3,Irradiance!$D$2:$AB$2,0)-1)","v":{"$error":"#N/A"}},2,"Single 1/4\" Glass",{"$f":"IF(ISERROR(VLOOKUP(SMALL('Ref Tables'!$G$3:$G$75,'Window Film'!$AO5),'Ref Tables'!$G$3:$H$75,2,0)),\"\",VLOOKUP(SMALL('Ref Tables'!$G$3:$G$75,'Window Film'!$AO5),'Ref Tables'!$G$3:$H$75,2,0))","v":"BRZ"},{"$f":"IF(AQ5=\"\",\"\",VLOOKUP(AQ5,'Ref Tables'!$C$1:$D$7,2,0))","v":"Bronze"},{"$f":"AQ5","v":"BRZ"},{"$f":"IF(ISERROR(VLOOKUP(SMALL('Ref Tables'!$I$3:$I$75,'Window Film'!AO5),'Ref Tables'!$I$3:$J$75,2,0)),\"\",VLOOKUP(SMALL('Ref Tables'!$I$3:$I$75,'Window Film'!AO5),'Ref Tables'!$I$3:$J$75,2,0))","v":"Low-E(.2) on surface 2"},"Stainless Steel 14%",{"$f":"'Ref Tables'!#REF!","v":{"$error":"#REF!"}},"Evaporative Cooler or IDEC"]
[null,"Project Name",null,null,null,null,null,null,null,null,"City",null,null,null,null,null,"Glazing",null,null,null,null,null,4,"CA","PP",null,null,"Updated October 14, 2014 Ave Secondary rates except where noted",null,null,null,null,null,null,null,null,null,null,null,null,3,"Double 1/8\" Glass",{"$f":"IF(ISERROR(VLOOKUP(SMALL('Ref Tables'!$G$3:$G$75,'Window Film'!$AO6),'Ref Tables'!$G$3:$H$75,2,0)),\"\",VLOOKUP(SMALL('Ref Tables'!$G$3:$G$75,'Window Film'!$AO6),'Ref Tables'!$G$3:$H$75,2,0))","v":"GRN"},{"$f":"IF(AQ6=\"\",\"\",VLOOKUP(AQ6,'Ref Tables'!$C$1:$D$7,2,0))","v":"Green"},"GRN",{"$f":"IF(ISERROR(VLOOKUP(SMALL('Ref Tables'!$I$3:$I$75,'Window Film'!AO6),'Ref Tables'!$I$3:$J$75,2,0)),\"\",VLOOKUP(SMALL('Ref Tables'!$I$3:$I$75,'Window Film'!AO6),'Ref Tables'!$I$3:$J$75,2,0))","v":"Low-E(.2) on surface 3"},"Stainless Steel 20%",{"$f":"'Ref Tables'!#REF!","v":{"$error":"#REF!"}},"Chilled Water (Water Cooled)"]
[null,"Business Name",null,null,null,null,null,null,null,null,"Cooling",null,null,null,null,null,"Glass Tint",null,null,null,null,null,5,"WA",null,null,null,null,null,null,"SHGC Existing Windows",{"$f":"IF(ISERROR(MAX('Ref Tables'!$E$3:$E$75)),0,MAX('Ref Tables'!$E$3:$E$75))","v":0},null,null,null,null,null,null,null,null,4,"Double 1/4\" Glass",{"$f":"IF(ISERROR(VLOOKUP(SMALL('Ref Tables'!$G$3:$G$75,'Window Film'!$AO7),'Ref Tables'!$G$3:$H$75,2,0)),\"\",VLOOKUP(SMALL('Ref Tables'!$G$3:$G$75,'Window Film'!$AO7),'Ref Tables'!$G$3:$H$75,2,0))","v":"GRY"},{"$f":"IF(AQ7=\"\",\"\",VLOOKUP(AQ7,'Ref Tables'!$C$1:$D$7,2,0))","v":"Grey"},"GRY",{"$f":"IF(ISERROR(VLOOKUP(SMALL('Ref Tables'!$I$3:$I$75,'Window Film'!AO7),'Ref Tables'!$I$3:$J$75,2,0)),\"\",VLOOKUP(SMALL('Ref Tables'!$I$3:$I$75,'Window Film'!AO7),'Ref Tables'!$I$3:$J$75,2,0))","v":"Low-E(.1) on surface 2"},"Titanium 20%",{"$f":"'Ref Tables'!#REF!","v":{"$error":"#REF!"}},"Chilled Water (Air Cooled)"]
[null,"Address",null,null,null,null,null,null,null,null,"Heating",null,null,null,null,"Coating",null,null,null,null,null,null,6,"AK","All Filled out",null,null,"State","Cost",null,"SHGC New Windows",{"$f":"($S$11/$P$11)*AF7","v":{"$error":"#DIV/0!"}},null,null,null,null,null,null,null,null,5,"Triple 1/8\" Glass",{"$f":"IF(ISERROR(VLOOKUP(SMALL('Ref Tables'!$G$3:$G$75,'Window Film'!$AO8),'Ref Tables'!$G$3:$H$75,2,0)),\"\",VLOOKUP(SMALL('Ref Tables'!$G$3:$G$75,'Window Film'!$AO8),'Ref Tables'!$G$3:$H$75,2,0))","v":"BLUGRN"},{"$f":"IF(AQ8=\"\",\"\",VLOOKUP(AQ8,'Ref Tables'!$C$1:$D$7,2,0))","v":"Blue Green"},"BLUGRN",{"$f":"IF(ISERROR(VLOOKUP(SMALL('Ref Tables'!$I$3:$I$75,'Window Film'!AO8),'Ref Tables'!$I$3:$J$75,2,0)),\"\",VLOOKUP(SMALL('Ref Tables'!$I$3:$I$75,'Window Film'!AO8),'Ref Tables'!$I$3:$J$75,2,0))","v":"Low-E(.1) on surface 3"},"Titanium 30%",{"$f":"'Ref Tables'!#REF!","v":{"$error":"#REF!"}},"Electric "]
[null,"City",null,null,null,"State",null,"Zip",null,null,"Project Cost",null,"Film Manufacturer",null,null,null,"Film Model",null,null,null,null,null,7,"AL",{"$f":"IF(AND(H5,R14,Q5=\"\",ISNUMBER(SEARCH(\"effective as of\",$F$12))),TRUE,FALSE)","v":false},null,null,null,{"$f":"VLOOKUP($G$9&\" \"&$I$11,$AB$11:$AD$40,2,0)","v":{"$error":"#N/A"}},{"$f":"VLOOKUP($G$9&\" \"&$I$11,$AB$11:$AD$40,3,0)","v":{"$error":"#N/A"}},"Existing Window Summer Solar Heat Gain",{"$f":"SUMPRODUCT($AF$4:$AM$4,$L$13:$S$13)*$AF$7","v":{"$error":"#N/A"}},"Btu/hr",null,null,null,null,null,null,null,6,"Triple 1/4\" Glass",{"$f":"IF(ISERROR(VLOOKUP(SMALL('Ref Tables'!$G$3:$G$75,'Window Film'!$AO9),'Ref Tables'!$G$3:$H$75,2,0)),\"\",VLOOKUP(SMALL('Ref Tables'!$G$3:$G$75,'Window Film'!$AO9),'Ref Tables'!$G$3:$H$75,2,0))","v":"HI-P GRN"},{"$f":"IF(AQ9=\"\",\"\",VLOOKUP(AQ9,'Ref Tables'!$C$1:$D$7,2,0))","v":"HI-Pass Green"},"HI-P GRN",{"$f":"IF(ISERROR(VLOOKUP(SMALL('Ref Tables'!$I$3:$I$75,'Window Film'!AO9),'Ref Tables'!$I$3:$J$75,2,0)),\"\",VLOOKUP(SMALL('Ref Tables'!$I$3:$I$75,'Window Film'!AO9),'Ref Tables'!$I$3:$J$75,2,0))","v":"Low-E(.05) on surface 2"},null,null,"Heat Pump"]
[null,"Contact Person",null,null,null,null,null,null,null,null,null,null,null,"Please visit WWW.NFRC.ORG to find Your Films SHGC Values",null,null,null,null,null,null,null,null,8,"AR",{"$f":"TODAY()","v":"2025-03-31"},null,null,null,"kWh","Demand","Existing Window Winter Solar Heat Gain",{"$f":"SUMPRODUCT($AF$5:$AM$5,$L$13:$S$13)*$AF$7","v":{"$error":"#N/A"}},"Btu/hr",null,null,null,null,null,null,null,7,null,{"$f":"IF(ISERROR(VLOOKUP(SMALL('Ref Tables'!$G$3:$G$75,'Window Film'!$AO10),'Ref Tables'!$G$3:$H$75,2,0)),\"\",VLOOKUP(SMALL('Ref Tables'!$G$3:$G$75,'Window Film'!$AO10),'Ref Tables'!$G$3:$H$75,2,0))","v":"BLU"},{"$f":"IF(AQ10=\"\",\"\",VLOOKUP(AQ10,'Ref Tables'!$C$1:$D$7,2,0))","v":"Blue"},"BLU",{"$f":"IF(ISERROR(VLOOKUP(SMALL('Ref Tables'!$I$3:$I$75,'Window Film'!AO10),'Ref Tables'!$I$3:$J$75,2,0)),\"\",VLOOKUP(SMALL('Ref Tables'!$I$3:$I$75,'Window Film'!AO10),'Ref Tables'!$I$3:$J$75,2,0))","v":"Low-E(.2) on surface 5"},null,null,"Gas"]
{"$rows_left_out":43}
{"sheet":"Ref Tables","index":1,"n_rows":75,"n_cols":18,"rows_kept":75,"cut":false,"hidden":true,"merged":[[0,15,1,15],[0,0,0,1],[6,0,6,1],[0,10,0,14],[0,4,0,9]]}
["HVAC COP",null,"CLR","Clear","Filter",null,null,null,null,null,"ASHRAE Fundamentals 2005, Sections 31.26 - 31.39",null,null,null,null,"Filter Ref"]
["Cooling Types","COP","BRZ","Bronze","SHGC","Unique Glazing","Unique Tint","Tint","Unique Coating","Coating","ASHRAE Ref","Glazing","Tint","Coating","SHGC",null,null,{"$f":"IF(AND(N3<>\"Reflective\",OR(N3='Window Film'!$AT$3,'Window Film'!$AT$3=\"\")),IF(OR(M3='Window Film'!$AQ$3,'Window Film'!$AQ$3=\"\"),IF(OR(L3='Window Film'!$AP$3,'Window Film'!$AP$3=\"\"), 'Ref Tables'!P3,\"\"),\"\"),\"\")","v":1}]
["AC",2.9,"GRY","Grey",{"$f":"IF(L3&M3&N3='Window Film'!$AP$3&'Window Film'!$AQ$3&'Window Film'!$AT$3,'Ref Tables'!O3,\"\")","v":""},{"$f":"IF(AND(N3<>\"Reflective\",OR(L3='Window Film'!$AP$3,'Window Film'!$AP$3=\"\")), 'Ref Tables'!P3,\"\")","v":1},{"$f":"IF(H3=\"\",\"\",F3)","v":1},{"$f":"IF(F3=\"\",\"\",IF(ISERROR(MATCH(M3,$H$2:H2,0)),M3,\"\"))","v":"CLR"},{"$f":"IF(J3=\"\",\"\",F3)","v":1},{"$f":"IF(F3=\"\",\"\",IF(ISERROR(MATCH(N3,$J$2:J2,0)),N3,\"\"))","v":"Uncoated"},"1a","Single 1/8\" Glass","CLR","Uncoated",0.86,1]
["Evaporative Cooler or IDEC",20,"GRN","Green",{"$f":"IF(L4&M4&N4='Window Film'!$AP$3&'Window Film'!$AQ$3&'Window Film'!$AT$3,'Ref Tables'!O4,\"\")","v":""},{"$f":"IF(AND(N4<>\"Reflective\",OR(L4='Window Film'!$AP$3,'Window Film'!$AP$3=\"\")), 'Ref Tables'!P4,\"\")","v":2},{"$f":"IF(H4=\"\",\"\",F4)","v":""},{"$f":"IF(F4=\"\",\"\",IF(ISERROR(MATCH(M4,$H$2:H3,0)),M4,\"\"))","v":""},{"$f":"IF(J4=\"\",\"\",F4)","v":""},{"$f":"IF(F4=\"\",\"\",IF(ISERROR(MATCH(N4,$J$2:J3,0)),N4,\"\"))","v":""},"1b","Single 1/4\" Glass","CLR","Uncoated",0.81,2]
["Chilled Water (Water Cooled)",4.2,"BLUGRN","Blue Green",{"$f":"IF(L5&M5&N5='Window Film'!$AP$3&'Window Film'!$AQ$3&'Window Film'!$AT$3,'Ref Tables'!O5,\"\")","v":""},{"$f":"IF(AND(N5<>\"Reflective\",OR(L5='Window Film'!$AP$3,'Window Film'!$AP$3=\"\")), 'Ref Tables'!P5,\"\")","v":3},3,{"$f":"IF(F5=\"\",\"\",IF(ISERROR(MATCH(M5,$H$2:H4,0)),M5,\"\"))","v":"BRZ"},"",{"$f":"IF(F5=\"\",\"\",IF(ISERROR(MATCH(N5,$J$2:J4,0)),N5,\"\"))","v":""},"1c","Single 1/8\" Glass","BRZ","Uncoated",0.73,3]
["Chilled Water (Air Cooled)",3.2,"BLU","Blue",{"$f":"IF(L6&M6&N6='Window Film'!$AP$3&'Window Film'!$AQ$3&'Window Film'!$AT$3,'Ref Tables'!O6,\"\")","v":""},{"$f":"IF(AND(N6<>\"Reflective\",OR(L6='Window Film'!$AP$3,'Window Film'!$AP$3=\"\")), 'Ref Tables'!P6,\"\")","v":4},"",{"$f":"IF(F6=\"\",\"\",IF(ISERROR(MATCH(M6,$H$2:H5,0)),M6,\"\"))","v":""},"",{"$f":"IF(F6=\"\",\"\",IF(ISERROR(MATCH(N6,$J$2:J5,0)),N6,\"\"))","v":""},"1d","Single 1/4\" Glass","BRZ","Uncoated",0.62,4]
["Heating Types",null,"HI-P GRN","HI-Pass Green",{"$f":"IF(L7&M7&N7='Window Film'!$AP$3&'Window Film'!$AQ$3&'Window Film'!$AT$3,'Ref Tables'!O7,\"\")","v":""},{"$f":"IF(AND(N7<>\"Reflective\",OR(L7='Window Film'!$AP$3,'Window Film'!$AP$3=\"\")), 'Ref Tables'!P7,\"\")","v":5},5,{"$f":"IF(F7=\"\",\"\",IF(ISERROR(MATCH(M7,$H$2:H6,0)),M7,\"\"))","v":"GRN"},"",{"$f":"IF(F7=\"\",\"\",IF(ISERROR(MATCH(N7,$J$2:J6,0)),N7,\"\"))","v":""},"1e","Single 1/8\" Glass","GRN","Uncoated",0.7,5]
["Electric ",1,null,null,{"$f":"IF(L8&M8&N8='Window Film'!$AP$3&'Window Film'!$AQ$3&'Window Film'!$AT$3,'Ref Tables'!O8,\"\")","v":""},{"$f":"IF(AND(N8<>\"Reflective\",OR(L8='Window Film'!$AP$3,'Window Film'!$AP$3=\"\")), 'Ref Tables'!P8,\"\")","v":6},"",{"$f":"IF(F8=\"\",\"\",IF(ISERROR(MATCH(M8,$H$2:H7,0)),M8,\"\"))","v":""},"",{"$f":"IF(F8=\"\",\"\",IF(ISERROR(MATCH(N8,$J$2:J7,0)),N8,\"\"))","v":""},"1f","Single 1/4\" Glass","GRN","Uncoated",0.6,6]
["Heat Pump",3.2,null,null,{"$f":"IF(L9&M9&N9='Window Film'!$AP$3&'Window Film'!$AQ$3&'Window Film'!$AT$3,'Ref Tables'!O9,\"\")","v":""},{"$f":"IF(AND(N9<>\"Reflective\",OR(L9='Window Film'!$AP$3,'Window Film'!$AP$3=\"\")), 'Ref Tables'!P9,\"\")","v":7},7,{"$f":"IF(F9=\"\",\"\",IF(ISERROR(MATCH(M9,$H$2:H8,0)),M9,\"\"))","v":"GRY"},"",{"$f":"IF(F9=\"\",\"\",IF(ISERROR(MATCH(N9,$J$2:J8,0)),N9,\"\"))","v":""},"1g","Single 1/8\" Glass","GRY","Uncoated",0.7,7]
["Gas",0.8,null,null,{"$f":"IF(L10&M10&N10='Window Film'!$AP$3&'Window Film'!$AQ$3&'Window Film'!$AT$3,'Ref Tables'!O10,\"\")","v":""},{"$f":"IF(AND(N10<>\"Reflective\",OR(L10='Window Film'!$AP$3,'Window Film'!$AP$3=\"\")), 'Ref Tables'!P10,\"\")","v":8},"",{"$f":"IF(F10=\"\",\"\",IF(ISERROR(MATCH(M10,$H$2:H9,0)),M10,\"\"))","v":""},"",{"$f":"IF(F10=\"\",\"\",IF(ISERROR(MATCH(N10,$J$2:J9,0)),N10,\"\"))","v":""},"1h","Single 1/4\" Glass","GRY","Uncoated",0.59,8]
{"$rows_left_out":66}
{"sheet":"Irradiance","index":2,"n_rows":25,"n_cols":32,"rows_kept":25,"cut":false,"hidden":true,"merged":[[0,27,0,28],[3,1,12,1],[0,0,1,2],[2,0,2,2],[14,1,24,1],[0,3,0,26]]}
["Solar Irradiance and Average Day Light Hours ",null,null,"Solar Irradiance, Ed (Average Day Hour, SHGC=1.0)"]
[null,null,null,null,null,"N",null,null,"NE",null,null,"E",null,null,"SE",null,null,"S",null,null,"SW",null,null,"W",null,null,"NW","ADLH"]
["Source: Ashrae 1997 Fundamentals, Section 29, Table 15-Table21",null,null,"Morning","Afternoon","Average","Morning","Afternoon","Average","Morning","Afternoon","Average","Morning","Afternoon","Average","Morning","Afternoon","Average","Morning","Afternoon","Average","Morning","Afternoon","Average","Morning","Afternoon","Average",null,null,"day light hours","heating and cooling degree days","Weighted irradiant hours"]
[1,"Summer","St. George, UT (Latitude 37°)",227,227,{"$f":"SUM(D4:E4)/12/0.86","v":43.992248062015506},707,174,{"$f":"SUM(G4:H4)/12/0.86","v":85.368217054263567},990,175.6,{"$f":"SUM(J4:K4)/12/0.86","v":112.94573643410853},830.7,193.6,{"$f":"SUM(M4:N4)/12/0.86","v":99.253875968992247},317.5,317.5,{"$f":"SUM(P4:Q4)/12/0.86","v":61.531007751937985},193.6,830.7,{"$f":"SUM(S4:T4)/12/0.86","v":99.253875968992247},175.6,990,{"$f":"SUM(V4:W4)/12/0.86","v":112.94573643410853},174,707,{"$f":"SUM(Y4:Z4)/12/0.86","v":85.368217054263567},{"$f":"AF4","v":1177.3854590482929},null,2456,2710,{"$f":"AD4*(AE4/(AE15+AE4))","v":1177.3854590482929}]
[2,null,"Price,  UT (Latitude 39°)",229,229,{"$f":"SUM(D5:E5)/12/0.86","v":44.379844961240309},709,174,{"$f":"SUM(G5:H5)/12/0.86","v":85.562015503875969},992,175.9,{"$f":"SUM(J5:K5)/12/0.86","v":113.16860465116279},864.2,197.9,{"$f":"SUM(M5:N5)/12/0.86","v":102.91666666666667},344.5,344.5,{"$f":"SUM(P5:Q5)/12/0.86","v":66.763565891472865},197.9,864.2,{"$f":"SUM(S5:T5)/12/0.86","v":102.91666666666667},175.9,992,{"$f":"SUM(V5:W5)/12/0.86","v":113.16860465116279},174,709,{"$f":"SUM(Y5:Z5)/12/0.86","v":85.562015503875969},{"$f":"AF5","v":205.93357320786049},null,2476,601,{"$f":"AD5*(AE5/(AE16+AE5))","v":205.93357320786049}]
[3,null,"Salt Lake City,  UT (Latitude 40°)",215,215,41.666666666666671,666,174,81.395348837209298,1024,176,116.27906976744187,881,200,104.74806201550388,358,358,69.379844961240309,200,881,104.74806201550388,176,1024,116.27906976744187,174,666,81.395348837209298,441.37801608579088,null,2484,1193,441.37801608579088]
[4,null,"Rock Springs, WY (Latitude 41.5°)",215,215,41.666666666666671,662.1,173.8,80.998062015503891,1031.7,175.6,116.98643410852713,904.6,204.7,107.49031007751938,381.4,381.4,73.914728682170534,204.7,904.6,107.49031007751938,175.6,1031.7,116.98643410852713,173.8,662.1,80.998062015503891,80.592592592592595,null,2496,272,80.592592592592595]
[5,null,"Yreka, CA (42°)",215,215,41.666666666666671,660.8,173.8,80.872093023255815,1034.2,175.5,117.21899224806202,912.5,206.2,108.40116279069768,389.2,389.2,75.426356589147275,206.2,912.5,108.40116279069768,175.5,1034.2,117.21899224806202,173.8,660.8,80.872093023255815,220.67560685791884,null,2500,520,220.67560685791884]
[6,null,"Crescent City, CA (42°)",215,215,41.666666666666671,660.8,173.8,80.872093023255815,1034.2,175.5,117.21899224806202,912.5,206.2,108.40116279069768,389.2,389.2,75.426356589147275,206.2,912.5,108.40116279069768,175.5,1034.2,117.21899224806202,173.8,660.8,80.872093023255815,0.54478099803878843,null,2500,1,0.54478099803878843]
[7,null,"Pocatello,  ID (Latitude 42.5°)",215,215,41.666666666666671,659.4,173.7,80.726744186046503,1036.8,175.5,117.47093023255813,920.4,207.8,109.32170542635659,397.1,397.1,76.957364341085281,207.8,920.4,109.32170542635659,175.5,1036.8,117.47093023255813,173.7,659.4,80.726744186046503,140.75342098202307,null,2504,419,140.75342098202307]
{"$rows_left_out":16}
{"sheet":"Help","index":3,"n_rows":44,"n_cols":5,"rows_kept":44,"cut":false,"hidden":false,"merged":[[11,0,11,15],[0,0,1,15],[3,0,3,14],[7,0,7,15],[9,0,9,5],[24,0,24,15],[38,0,38,15],[12,0,12,14],[13,1,13,15],[14,0,14,14],[15,0,15,14],[19,3,19,6],[20,3,20,5],[34,2,34,3],[33,2,33,3],[35,2,35,3],[32,2,32,3],[31,2,31,3],[36,2,36,3]]}
["Window Film Calculator Help"]
[]
[]
["Note:  This window film calculator is provided for the express use of wattsmart Business approved EEA Participants only.  Any other use of this window film calculator tool is unauthorized unless specifically approved otherwise by the wattsmart Business Program Administrator or Rocky Mountain Power/Pacific Power"]
[]
["When to Use this Window Film Calculator"]
[]
["This window film calculator is designed to be used for obtaining basic savings and incentive information for installation of window film"]
[]
["How to Help Customers Obtain Incentives for window film"]
{"$rows_left_out":35}
{"sheet":"Change Log","index":4,"n_rows":10,"n_cols":5,"rows_kept":10,"cut":false,"hidden":true,"merged":[]}
["Date","Change Description","Name","Previous Revision #","New Revision #"]
["2012-08-16","updated RMP rates (ID, UT, WY)","Troy Williams","071412","071412.2"]
["2013-12-27","Updated for new WA tariff incentive rate ($0.15/kWh for new tariff, $0.12/kWh A4 for the previous tariff)","Jake DeMann","070113.2","010114.1"]
["2014-01-07","Updated rates, using Rates for Software 1-1-2014","Jake DeMann",10114.1,10114.1]
["2014-10-15","Changes:\n-          ID incentive rate changed to $0.15/kWh (previously $0.12/kWh)\n-          Rate schedules updated to match Rates for Software 6-8-14\n-          ID tariff date updated\n-          Version number updated \n","Jake DeMann","010114.1",110114.1]
["2014-11-24","- Version # revised, beta version for testing, release version to be 120114.1\n- Wyoming tariff effective date revised to 12/01/2014\n- Wyoming incentive rate changed to $0.15/kWh (Only CA remains at $0.12/kWh)\n- Wyoming tariff messaging revised to schedule 140\n","Jake DeMann",110114.1,"beta 120114"]
["2014-12-15","Finalized tool, version number","Jake DeMann","beta 120114","120114.1"]
["2015-04-10","- Version # revised, beta version for testing, release version to be 050115.1\n- CA tariff effective date revised to 5/01/2015\n- CA incentive rate changed to $0.15/kWh \n- CA tariff messaging revised to schedule 140\n",null,"120114.1","beta 050115"]
["2015-05-22","Made corrections as noted in QC Review:\n-Corrected CA effective Date\n-Added functionality to inform user when the dates do not align with effective date\n-Corrected the CA incentive listed in the Help tab\n-Updated Rates to align with Rates for Software 5-1-2015\n-Finalized the version number","Joe Larsen","beta 050115",50115.1]
["2016-07-07","Updated rates, using Rates for Software 6-17-2016","Jake DeMann",50115.1,"071116.1"]