{"text_format":"1","workbook":"xlsx","n_sheets":25,"sheets":["Chiller-Tool","Chiller Calculator","HELP","Application NEW","Lookups","Weather Data","Degree Days","Chiller Data","Chiller Data (Original Copy)","EFLH Lookup","Rates","CA Title 24-2008","IECC 2003","IECC 2006","IECC 2009","WSEC 2009","WSEC 2006","IECC & WSEC 2012","IECC 2015","IECC 2018","IECC 2021","WSEC 2018","WSEC 2021","CA Title 24-2013","Change Log"],"not_rendered":{"charts":0,"images":26,"macros":1,"external_links":0,"defined_names":144,"comments":4,"pivot_tables":0},"unopened":[],"bounds":{"document_bytes":16777216,"sheet_cells":100000,"rows_first":2000,"rows_last":500,"rows_between":2000,"halvings":0,"cell_chars":16384,"cell_head_chars":4096},"cells_cut":0,"cells_raw":0,"read":"whole","date_system":"1900"}

{"sheet":"Chiller-Tool","index":0,"n_rows":32,"n_cols":76,"rows_kept":32,"cut":false,"hidden":false,"merged":[[23,8,23,15],[23,17,23,23],[31,2,31,4],[31,8,31,10],[29,5,29,6],[30,5,30,6],[31,5,31,6],[30,11,30,13],[31,11,31,13],[25,11,25,15],[26,11,26,15],[27,11,27,15],[24,8,24,10],[25,8,25,10],[28,2,28,4],[29,2,29,4],[24,5,24,6],[25,5,25,6],[26,5,26,6],[30,8,30,10],[24,2,24,4],[25,2,25,4],[26,2,26,4],[27,2,27,4],[20,2,20,4],[20,5,20,11],[20,13,20,14],[27,8,27,10],[29,8,29,10],[29,14,29,15],[23,2,23,6],[31,14,31,15],[26,8,26,10],[20,15,20,23],[21,2,21,4],[21,5,21,6],[21,7,21,9],[21,10,21,11],[21,13,21,14],[21,15,21,19],[21,20,21,21],[21,22,21,23],[29,11,29,13],[28,5,28,6],[27,5,27,6],[30,2,30,4],[30,14,30,15],[24,11,24,15],[17,20,17,23],[18,2,18,4],[18,13,18,14],[18,15,18,23],[19,2,19,5],[19,6,19,11],[19,13,19,14],[19,15,19,19],[19,20,19,23],[16,2,16,4],[16,5,16,6],[16,7,16,11],[17,2,17,4],[17,5,17,11],[17,13,17,19],[14,5,14,6],[14,7,14,8],[14,9,14,11],[15,2,15,4],[15,5,15,6],[15,7,15,11],[16,13,16,19],[9,2,9,4],[9,5,9,6],[9,7,9,8],[9,9,9,11],[9,13,9,14],[10,2,10,4],[10,5,10,11],[10,17,10,22],[11,2,11,6],[11,13,15,23],[12,2,12,4],[12,5,12,11],[13,2,13,4],[13,5,13,11],[14,2,14,4],[7,2,7,4],[7,5,7,8],[7,9,7,11],[7,13,7,14],[7,17,7,22],[8,2,8,4],[8,5,8,11],[8,13,8,14],[8,17,8,22],[2,2,3,11],[4,2,4,4],[4,7,4,8],[4,9,4,11],[5,7,5,8],[5,9,5,11],[5,20,5,21],[6,2,6,6],[6,7,6,8],[6,9,6,11],[6,16,6,22],[31,17,31,20],[24,21,24,23],[25,21,25,23],[26,21,26,23],[27,21,27,23],[29,21,29,23],[30,21,30,23],[31,21,31,23],[24,17,24,20],[25,17,25,20],[26,17,26,20],[27,17,27,20],[29,17,29,20],[30,17,30,20],[28,17,28,23]]}
[]
[]
[null,null,"Chiller Calculator Tool"]
[]
[null,null,{"$f":"\"Version: \" & INDEX(CurrentVersion_List,MATCH(\"a\",CurrentVersionSelected_List,0))","v":"Version: 073124.1"},null,null,null,null,"Application Date"]
[null,null,null,null,null,null,null,"Invoice/Install Date",null,null,null,null,null,null,{"$f":"TODAY()","v":"2025-12-30"}]
[null,null,"Project Information",null,null,null,null,null,null,null,null,null,null,null,null,null,"Instructions"]
[null,null,"Project Name/Type",null,null,null,null,null,null,null,null,null,null,null,null,"User Input Fields",null,"1 - Complete all yellow fields",null,null,null,null,null,null,null,null,null,null,null,null,null,null,null,null,null,null,null,null,null,null,null,null,null,null,null,null,null,null,null,null,null,null,null,null,null,null,null,null,null,null,null,null,null,null,null,null,null,null,null,null,null,null,null,null,null,true]
[null,null,"Installation Address",null,null,null,null,null,null,null,null,null,null,null,null,"Completed Fields",null,"2 - Save a copy of this HVAC tool",null,null,null,null,null,null,null,null,null,null,null,null,null,null,null,null,null,null,null,null,null,null,null,null,null,null,null,null,null,null,null,null,null,null,null,null,null,null,null,null,null,null,null,null,null,null,null,null,null,null,null,null,null,null,null,null,null,false]
[null,null,"City/State/Zip",null,null,null,null,null,null,null,null,null,null,null,null,"Calculated Fields",null,null,null,null,null,null,null,null,null,null,null,null,null,null,null,null,null,null,null,null,null,null,null,null,null,null,null,null,null,null,null,null,null,null,null,null,null,null,null,null,null,null,null,null,null,null,null,null,null,null,null,null,null,null,null,null,null,null,null,true]
[null,null,"Contractor/Dealer Name",null,null,null,null,null,null,null,null,null,null,null,null,null,null,"4 - Follow the instructions on the incentive application"]
[null,null,"Participant Information",null,null,null,null,null,null,null,null,null,null,{"$f":"IF(AND(InstallState=\"\",InstallDate=\"\"),\"\",IF(OR(InstallState=\"\",InstallDate=\"\"),\"Please enter an install date and select a state in the Project Information section.\",\"Calculator results are in accordance with \" & INDEX(StateName_List,MATCH(InstallState,StateAbrev_List,0)) &\" Tariff \" & INDEX(Incentives[Tariff Number],MATCH(CONCATENATE(InstallState,\" - Active\"),Incentives[Active],0)) & \", effective \"& INDEX(Incentives[Text Date],MATCH(CONCATENATE(InstallState,\" - Active\"),Incentives[Active],0)) & \", and are estimates only. Actual energy savings and incentives paid will be determined based on the results of a post-installation inspection and review of project invoices.\"&\" Calculator results are valid only for equipment purchased and installed on or after the effective tariff date.\"))","v":""}]
[null,null,"Business Name"]
[null,null,"Address"]
[null,null,"City/State/Zip"]
[null,null,"Contact Person/Title"]
[null,null,"Phone/Email",null,null,null,null,null,null,null,null,null,null,"Incentive Payee Information"]
[null,null,"Business Type",null,null,null,null,null,null,null,null,null,null,"Select where the incentive will be paid in the drop down selector >>"]
[null,null,"Participant is >>",null,null,null,null,null,null,null,null,null,null,"Business Name"]
[null,null,"Account Information",null,null,null,{"$f":"IF(OR(InstallState=\"\",RateSchedule=\"\"),\"\",\"Rate Schedule \" & RateSchedule & \" effective \" & TEXT(INDEX(Rates!I10:I14,MATCH(InstallState,Rates!H10:H14,0)),\"mm/dd/yyyy\"))","v":""},null,null,null,null,null,null,"Contact Name/Phone"]
[null,null,"Account Name",null,null,null,null,null,null,null,null,null,null,"Address"]
[null,null,"Account/Meter/Rate",null,null,null,null,null,null,null,null,null,null,"City/State/Zip"]
[]
[null,null,"Equipment & Facility Information",null,null,null,null,null,{"$f":"IF(AND(InstallState=\"\",OR(ChillerCapacity<>\"\",ChillerIPLV<>\"\",ChillerFullLoadEfficiency<>\"\",ChillerServiceType<>\"\",ChillerType<>\"\")),\"Please select install state before proceeding.\",IF(AND(RateSchedule=\"\",V31=\"\",L31<>\"\"),\"Please select a valid rate schedule.\",\"\"))","v":""},null,null,null,null,null,null,null,null,{"$f":"IFERROR(IF(AND(InstallState<>\"\",L31=\"Enter Required Data\",InstallDate=\"\"),\"Please enter an install date.\",Baseline_Energy_Code),\"\")","v":""}]
[null,null,"Chiller Service Type",null,null,null,null,null,"Nearest Weather Location",null,null,null,null,null,null,null,null,"Energy Savings (Annual)",null,null,null,{"$f":"IF(AND(CheckBoxLink_PathA=FALSE,CheckBoxLink_PathB=FALSE),\"\",'Chiller Calculator'!C36)","v":""}]
[null,null,"Chiller Type",null,null,null,null,null,"Cooling Degree Days",null,null,null,null,null,null,null,null,"Demand Savings (Peak)",null,null,null,{"$f":"IF(AND(CheckBoxLink_PathA=FALSE,CheckBoxLink_PathB=FALSE),\"\",'Chiller Calculator'!C37)","v":""}]
[null,null,"Heat Rejection",null,null,null,null,null,"Facility Type",null,null,null,null,null,null,null,null,"Demand Savings (Monthly)",null,null,null,{"$f":"IF(AND(CheckBoxLink_PathA=FALSE,CheckBoxLink_PathB=FALSE),\"\",'Chiller Calculator'!C38)","v":""}]
[null,null,"AHRI Capacity",null,null,null,null,null,"Equivalent Full Load Hours",null,null,{"$f":"IF(FacilityType=\"\",\"\",'Chiller Calculator'!C32)","v":""},null,null,null,null,null,"Cost Savings (Annual)",null,null,null,{"$f":"IF(AND(CheckBoxLink_PathA=FALSE,CheckBoxLink_PathB=FALSE),\"\",'Chiller Calculator'!C39)","v":""}]
[null,null,"AHRI Full-Load Efficiency",null,null,null,null,null,null,null,null,null,null,null,null,null,null,{"$f":"IF(AND(CheckBoxLink_PathA=FALSE,CheckBoxLink_PathB=FALSE),\"\",IF(ISNUMBER('Chiller Calculator'!C43)=FALSE,'Chiller Calculator'!C43,\"\"))","v":"Enter Incremental Cost"}]
[null,null,"AHRI IPLV",null,null,null,null,null,"Select Compliance Path >>",null,null,true,null,null,false,null,null,"Incentive",null,null,null,{"$f":"IF(AND(CheckBoxLink_PathA=FALSE,CheckBoxLink_PathB=FALSE),\"\",IF(ISNUMBER('Chiller Calculator'!C43)=TRUE,'Chiller Calculator'!C43,\"\"))","v":""}]
[null,null,"Total Cost",null,null,null,null,null,"Baseline Full Load",null,null,{"$f":"IF(OR(ChillerServiceType=\"\",ChillerType=\"\",HeatRejection=\"\",ChillerCapacity=\"\"),\"\",'Chiller Calculator'!C27)","v":""},null,null,{"$f":"IF(OR(ChillerServiceType=\"\",ChillerType=\"\",HeatRejection=\"\",ChillerCapacity=\"\"),\"\",'Chiller Calculator'!E27)","v":""},null,null,"Simple Payback (Before Incentives)",null,null,null,{"$f":"IF(V30=\"\",\"\",IF(ISNUMBER('Chiller Calculator'!C40)=TRUE,'Chiller Calculator'!C40,\"\"))","v":""}]
[null,null,"Incremental Cost",null,null,null,null,null,"Baseline IPLV",null,null,{"$f":"IF(OR(ChillerServiceType=\"\",ChillerType=\"\",HeatRejection=\"\",ChillerCapacity=\"\"),\"\",'Chiller Calculator'!C28)","v":""},null,null,{"$f":"IF(OR(ChillerServiceType=\"\",ChillerType=\"\",HeatRejection=\"\",ChillerCapacity=\"\"),\"\",'Chiller Calculator'!E28)","v":""},null,null,"Simple Payback (After Incentives)",null,null,null,{"$f":"IF(V30=\"\",\"\",IF(ISNUMBER('Chiller Calculator'!C44)=TRUE,'Chiller Calculator'!C44,\"\"))","v":""}]

{"sheet":"Chiller Calculator","index":1,"n_rows":64,"n_cols":23,"rows_kept":64,"cut":false,"hidden":true,"merged":[[44,1,44,5],[23,2,23,5],[25,10,25,11],[43,2,43,5],[42,2,42,5],[39,2,39,5],[38,2,38,5],[37,2,37,5],[24,2,24,5],[28,2,28,5],[34,2,34,5],[36,2,36,5],[35,2,35,5],[31,2,31,5],[30,2,30,5],[29,2,29,5],[17,10,17,14],[22,2,22,5],[18,2,18,5],[17,2,17,5],[20,1,20,5],[21,2,21,5],[19,2,19,5],[17,18,17,21],[2,2,2,5],[14,2,14,5],[13,2,13,5],[12,2,12,5],[11,2,11,5],[4,2,4,5],[7,2,7,5],[6,2,6,5],[5,2,5,5],[9,2,9,5],[8,2,8,5],[10,2,10,5],[16,2,16,5],[15,2,15,5],[3,2,3,5]]}
[{"$f":"IF(C7=\"\",\"VERSION: \" & Version,CONCATENATE(\"VERSION: \" & Version,\" - Tariff Effective: \",VLOOKUP(C7,TariffDates,2,FALSE)))","v":{"$error":"#N/A"}}]
[null,"Please Fill in All Yellow Shaded Cells"]
[null,"Participant Name",{"$f":"CustomerBusinessName","v":0}]
[null,"*Invoice Date (MM/DD/YYYY)","2022-02-02"]
[null,"Facility Address",{"$f":"InstallAddress","v":0}]
[null,"Facility City, State, Zip",{"$f":"InstallCity & \", \" & InstallState & \"  \" & InstallZip","v":",   "}]
[null,"*Service Territory",{"$f":"InstallState","v":0}]
[null,{"$f":"IF(ISERROR(C29),CONCATENATE(\"Rate Schedule \",C8,\" is not a valid schedule in \",C7),IF(C8=\"\",\"*Rate Schedule\",CONCATENATE(\"*Rate \",C8,\" effective as of: \",VLOOKUP(C7,Rates!H10:I14,2,FALSE))))","v":{"$error":"#N/A"}},{"$f":"RateSchedule","v":0}]
[null,"*Select Nearest Representative Location",{"$f":"NearestWeatherCity","v":0}]
[null,"*Facility Type",{"$f":"FacilityType","v":0},null,null,null,null,null,"Chiller Function"]
[null,"*Is the Chiller the Primary or Backup Service Unit?",{"$f":"ChillerServiceType","v":0}]
[null,"*Proposed Chiller Heat Rejection",{"$f":"HeatRejection","v":0},null,null,null,null,null,"Primary"]
[null,"*Proposed Chiller Type",{"$f":"ChillerType","v":0},null,null,null,null,null,"Backup"]
[null,"*Proposed Chiller Heat Rejection"]
[null,"*Proposed Chiller Type"]
[null,"*Proposed Chiller AHRI Capacity",{"$f":"IF(ChillerCapacity=\"\",\"\",ChillerCapacity)","v":""}]
[null,"*Proposed Chiller AHRI Full Load Efficiency(Enter kW/ton)",{"$f":"IF(ChillerFullLoadEfficiency=\"\",\"\",ChillerFullLoadEfficiency)","v":""},null,null,null,null,null,"Size Code",{"$f":"SUM(K17:P17)","v":6},{"$f":"IF($C$16<75,1,0)","v":0},{"$f":"IF(AND($C$16>=75,$C$16<150),2,0)","v":0},{"$f":"IF(AND($C$16>=150,$C$16<300),3,0)","v":0},{"$f":"IF(AND($C$16>=300,$C$16<400),4,0)","v":0},{"$f":"IF(AND($C$16>=400,$C$16<600),4,0)","v":0},{"$f":"IF($C$16>=600,6,0)","v":6},"Size Code",{"$f":"SUM(S17:W17)","v":5},{"$f":"IF($C$16<75,1,0)","v":0},{"$f":"IF(AND($C$16>=75,$C$16<150),2,0)","v":0},{"$f":"IF(AND($C$16>=150,$C$16<300),3,0)","v":0},{"$f":"IF(AND($C$16>=300,$C$16<600),4,0)","v":0},{"$f":"IF($C$16>600,5,0)","v":5}]
[null,"*Proposed Chiller AHRI IPLV (Enter kW/ton)",{"$f":"IF(ChillerIPLV=\"\",\"\",ChillerIPLV)","v":""},null,null,null,null,null,null,null,"Centrifugal Water-Cooled Size (Tons)",null,null,null,null,null,null,null," Positvie Displacement, Water-Cooled Size (Tons)"]
[null,"*Proposed Chiller Cost",{"$f":"ChillerCost","v":0},null,null,null,null,null,"State","Effective Date","<75","≥75 and <150","≥150 and <300","≥300 and <400","≥400 and <600","≥600","State","Effective Date","<75","≥75 and <150","≥150 and <300","≥300 and <600","≥600"]
[null,"*Incremental Cost above Code Baseline Cost ",{"$f":"ChillerIncrementalCost","v":0},null,null,null,null,null,"CA","2014-07-01",{"$f":"IF($C$4<$J20,1,\"A\")","v":"A"},{"$f":"IF($C$4<$J20,1,\"B\")","v":"B"},{"$f":"IF($C$4<$J20,2,\"C\")","v":"C"},{"$f":"IF($C$4<$J20,3,\"D\")","v":"D"},{"$f":"IF($C$4<$J20,3,\"E\")","v":"E"},{"$f":"IF($C$4<$J20,3,\"F\")","v":"F"},"CA","2014-07-01",{"$f":"IF($C$4<$J20,1,\"A\")","v":"A"},{"$f":"IF($C$4<$J20,1,\"B\")","v":"B"},{"$f":"IF($C$4<$J20,2,\"C\")","v":"C"},{"$f":"IF($C$4<$J20,3,\"D\")","v":"D"},{"$f":"IF($C$4<$J20,3,\"D\")","v":"D"}]
[null,"* indicates required field",null,null,null,null,null,null,"ID","2021-01-01",{"$f":"IF($C$4<$J21,1,\"A\")","v":"A"},{"$f":"IF($C$4<$J21,2,\"B\")","v":"B"},{"$f":"IF($C$4<$J21,3,\"C\")","v":"C"},{"$f":"IF($C$4<$J21,4,\"D\")","v":"D"},{"$f":"IF($C$4<$J21,5,\"E\")","v":"E"},{"$f":"IF($C$4<$J21,6,\"F\")","v":"F"},"ID","2011-01-01",{"$f":"IF($C$4<$J21,1,\"A\")","v":"A"},{"$f":"IF($C$4<$J21,2,\"B\")","v":"B"},{"$f":"IF($C$4<$J21,3,\"C\")","v":"C"},{"$f":"IF($C$4<$J21,4,\"D\")","v":"D"},{"$f":"IF($C$4<$J21,5,\"E\")","v":"E"}]
[null,"Lookup Values",{"$f":"IF(OR(C7=\"\",C4=\"\"),\"\",CONCATENATE(\"Baseline Energy Code: \",VLOOKUP(C7,EnergyCodes,3,FALSE)))","v":{"$error":"#N/A"}},null,null,null,null,null,"UT","2023-07-01",{"$f":"IF($C$4<$J22,1,\"A\")","v":1},{"$f":"IF($C$4<$J22,2,\"B\")","v":2},{"$f":"IF($C$4<$J22,3,\"C\")","v":3},{"$f":"IF($C$4<$J22,4,\"D\")","v":4},{"$f":"IF($C$4<$J22,5,\"E\")","v":5},{"$f":"IF($C$4<$J22,6,\"F\")","v":6},"UT","2016-07-01",{"$f":"IF($C$4<$J22,1,\"A\")","v":1},{"$f":"IF($C$4<$J22,2,\"B\")","v":2},{"$f":"IF($C$4<$J22,3,\"C\")","v":3},{"$f":"IF($C$4<$J22,4,\"D\")","v":4},{"$f":"IF($C$4<$J22,5,\"F\")","v":5}]
[null,"Size ID",{"$f":"IF(C7=\"\",\"Enter Required Data\",IF(C12=\"Water Cooled\",IF(C13=\"Centrifugal\",VLOOKUP(C7,I20:P24,J17+2,FALSE),VLOOKUP(C7,Q20:W24,R17+2,FALSE)),VLOOKUP(C7,I28:M32,J25+2)))","v":{"$error":"#N/A"}},null,null,null,"hidden field",null,"WA","2016-07-01",{"$f":"IF($C$4<$J23,1,\"A\")","v":"A"},{"$f":"IF($C$4<$J23,1,\"B\")","v":"B"},{"$f":"IF($C$4<$J23,2,\"C\")","v":"C"},{"$f":"IF($C$4<$J23,3,\"D\")","v":"D"},{"$f":"IF($C$4<$J23,3,\"E\")","v":"E"},{"$f":"IF($C$4<$J23,3,\"F\")","v":"F"},"WA","2016-07-01",{"$f":"IF($C$4<$J23,1,\"A\")","v":"A"},{"$f":"IF($C$4<$J23,1,\"B\")","v":"B"},{"$f":"IF($C$4<$J23,2,\"C\")","v":"C"},{"$f":"IF($C$4<$J23,3,\"D\")","v":"D"},{"$f":"IF($C$4<$J23,3,\"E\")","v":"E"}]
[null,"Baseline ID",{"$f":"IF(OR(C7=\"\",C12=\"\",C13=\"\",C23=\"\",C4=\"\",C16=\"\",C17=\"\",C18=\"\",C19=\"\",C20=\"\"),\"Enter Required Data\",CONCATENATE(C7,\"-\",C12,\"-\",C13,\"-\",C23))","v":{"$error":"#N/A"}},null,null,null,"hidden field",null,"WY","2014-12-01","A","B","C","D","E","F","WY","2009-01-01",{"$f":"IF($C$4<$J24,1,\"A\")","v":"A"},{"$f":"IF($C$4<$J24,1,\"B\")","v":"B"},{"$f":"IF($C$4<$J24,2,\"C\")","v":"C"},{"$f":"IF($C$4<$J24,3,\"D\")","v":"D"},{"$f":"IF($C$4<$J24,3,\"D\")","v":"D"}]
[null,"Proposed ID",{"$f":"IF(OR(C7=\"\",C14=0,C15=0,C23=\"\",C4=\"\"),\"Enter Required Data\",CONCATENATE(C7,\"-\",C14,\"-\",C15,\"-\",C23))","v":{"$error":"#N/A"}},null,null,null,"hidden field",null,"Size Code",{"$f":"SUM(K25:O25)","v":3},{"$f":"IF($C$16<150,1,0)","v":0},{"$f":"IF(AND($C$16>=150,$C$16<300),2,0)","v":0},{"$f":"IF($C$16>=300,3,0)","v":3}]
[null,null,"Path A","Units","Path B","Units",null,null,null,null,"Air-Cooled Size (Tons)"]
[null,"Baseline Full Load",{"$f":"IF(ISERROR(IF(C24=\"Enter Required Data\",C24,VLOOKUP(C24,ChillerData,7,FALSE))),\"Not a Valid Chiller Type\",IF(C24=\"Enter Required Data\",C24,ROUND(VLOOKUP(C24,ChillerData,7,FALSE),2)))","v":"Not a Valid Chiller Type"},{"$f":"IF(C24=\"Enter Required Data\",\"\",VLOOKUP(C24,ChillerData,11,FALSE))","v":{"$error":"#N/A"}},{"$f":"IF(C24=\"Enter Required Data\",C24,VLOOKUP(C24,ChillerData,9,FALSE))","v":{"$error":"#N/A"}},{"$f":"IF(C24=\"Enter Required Data\",\"\",VLOOKUP(C24,ChillerData,11,FALSE))","v":{"$error":"#N/A"}},null,null,"State","Effective Date","<150","≥150 and < 300","≥300",null,null,null,null,null,null,"Positive Displacement Chillers include:"]
[null,"Baseline IPLV",{"$f":"IF(ISERROR(IF(C24=\"Enter Required Data\",C24,ROUND(VLOOKUP(C24,ChillerData,8,FALSE),2))),\"Not a Valid Chiller Type\",IF(C24=\"Enter Required Data\",C24,ROUND(VLOOKUP(C24,ChillerData,8,FALSE),2)))","v":"Not a Valid Chiller Type"},{"$f":"IF(C24=\"Enter Required Data\",\"\",VLOOKUP(C24,ChillerData,11,FALSE))","v":{"$error":"#N/A"}},{"$f":"IF(C24=\"Enter Required Data\",C24,VLOOKUP(C24,ChillerData,10,FALSE))","v":{"$error":"#N/A"}},{"$f":"IF(C24=\"Enter Required Data\",\"\",VLOOKUP(C24,ChillerData,11,FALSE))","v":{"$error":"#N/A"}},null,null,"CA","2014-07-01",{"$f":"IF($C$4<$J28,1,\"A\")","v":"A"},{"$f":"IF($C$4<$J28,2,\"B\")","v":"B"},{"$f":"IF($C$4<$J28,3,\"B\")","v":"B"},null,null,null,null,null,null,"Screw, Reciprocating, Rotary, Scroll"]
[null,"Average Energy Cost",{"$f":"Rates!E8","v":"Enter State and Rate Schedule Into Yellow Cells Above"},null,null,null,null,null,"ID","2021-01-01",{"$f":"IF($C$4<$J29,1,\"A\")","v":"A"},{"$f":"IF($C$4<$J29,2,\"B\")","v":"B"},{"$f":"IF($C$4<$J29,2,\"B\")","v":"B"}]
[null,"Average Demand Cost",{"$f":"Rates!F8","v":"Enter State and Rate Schedule Into Yellow Cells Above"},null,null,null,null,null,"UT","2023-07-01",1,2,{"$f":"IF($C$4<$J30,2,\"B\")","v":2}]
[null,"Cooling Degree Days",{"$f":"IF(ISERROR(IF(C9=\"\",\"Enter Representative Location Into Yellow Cell Above\",VLOOKUP(C9,CDD,4,FALSE))),\"\",IF(C9=\"\",\"Enter Representative Location Into Yellow Cell Above\",VLOOKUP(C9,CDD,4,FALSE)))","v":""},null,null,null,null,null,"WA","2016-07-01","A","B",{"$f":"IF($C$4<$J31,2,\"B\")","v":"B"}]
[null,"Equivalent Full Load Hours",{"$f":"IF(ISERROR(IF(C10=\"\",\"Enter Facility Type Into Yellow Cell Above\",VLOOKUP(C10,EFLH,6,FALSE))),\"\",IF(C10=\"\",\"Enter Facility Type Into Yellow Cell Above\",VLOOKUP(C10,EFLH,6,FALSE)))","v":""},null,null,null,null,null,"WY","2014-12-01","A","B",{"$f":"IF($C$4<$J32,3,\"B\")","v":"B"}]
[]
[null,"Savings Calculations1"]
[null,"*Chosen Path of Compliance",{"$f":"IF(CheckBoxLink_PathA=TRUE,\"Path A\",IF(CheckBoxLink_PathB=TRUE,\"Path B\",\"\"))","v":"Path A"}]
[null,"Estimated Annual Energy Savings",{"$f":"IF(ISERROR(IF(C28=\"Enter Missing Data Into Yellow Cells Above\",\"Enter Missing Data Into Yellow Cells Above\",IF(OR(C35=\"Path A\",C35=\"Path B\"),((IF(C35=\"Path A\",C28,E28)-C18))*C16*C32,\"Select Path of Compliance\"))),\"\",IF(C28=\"Enter Missing Data Into Yellow Cells Above\",\"Enter Missing Data Into Yellow Cells Above\",IF(OR(C35=\"Path A\",C35=\"Path B\"),((IF(C35=\"Path A\",C28,E28)-C18))*C16*C32,\"Select Path of Compliance\")))","v":""},null,null,null,null,null,"Tariff Effective Dates","Applicable Tariff Date","Code Effective Dates","Applicable Tariff"]
[null,"Estimated Peak Demand Savings",{"$f":"IF(ISERROR(IF(C28=\"Enter Missing Data Into Yellow Cells Above\",\"Enter Missing Data Into Yellow Cells Above\",IF(OR(C35=\"Path A\",C35=\"Path B\"),((IF(C35=\"Path A\",C27,E27)-C17))*C16,\"Select Path of Compliance\"))),\"\",IF(C28=\"Enter Missing Data Into Yellow Cells Above\",\"Enter Missing Data Into Yellow Cells Above\",IF(OR(C35=\"Path A\",C35=\"Path B\"),((IF(C35=\"Path A\",C27,E27)-C17))*C16,\"Select Path of Compliance\")))","v":""},null,null,null,null,null,"CA",{"$f":"IF($C$4>=J44,K44,L44)","v":"May 1, 2015"},{"$f":"IF(C4<J28,\"Title 24 - 2008, Table 112-D\",\"Title 24 - 2013, Table 110.2-D\")","v":"Title 24 - 2013, Table 110.2-D"},{"$f":"IF($C$4>=J44,M44,N44)","v":140}]
[null,"Estimated Average Monthly Demand Savings",{"$f":"IF(ISERROR(IF(C28=\"Enter Missing Data Into Yellow Cells Above\",\"Enter Missing Data Into Yellow Cells Above\",IF(C37=\"Select Path of Compliance\",C37,0.37*C37))),\"\",IF(C28=\"Enter Missing Data Into Yellow Cells Above\",\"Enter Missing Data Into Yellow Cells Above\",IF(C37=\"Select Path of Compliance\",C37,0.37*C37)))","v":""},null,null,null,null,null,"ID",{"$f":"IF($C$4>=J45,K45,L45)","v":"November 13, 2014"},{"$f":"IF(C4<J29,\"IECC 2015\",\"IECC 2018\")","v":"IECC 2018"},{"$f":"IF($C$4>=J45,M45,N45)","v":140}]
[null,"Estimated Annual Cost Savings",{"$f":"IF(ISERROR(IF(C28=\"Enter Missing Data Into Yellow Cells Above\",\"Enter Missing Data Into Yellow Cells Above\",IF(C38=\"Select Path of Compliance\",C38,C29*C36+12*C38*C30))),\"\",IF(C28=\"Enter Missing Data Into Yellow Cells Above\",\"Enter Missing Data Into Yellow Cells Above\",IF(C38=\"Select Path of Compliance\",C38,C29*C36+12*C38*C30)))","v":""},null,null,null,null,null,"UT",{"$f":"IF($C$4>=J46,K46,L46)","v":"July 1, 2014"},{"$f":"IF(C4<J30,\"IECC 2018\",\"IECC 2021\")","v":"IECC 2018"},{"$f":"IF($C$4>=J46,M46,N46)","v":140}]
[null,"Simple Payback Before Incentives",{"$f":"IF(ISERROR(IF(C20>0,C20/C39,\"Enter Incremental Cost\")),\"\",IF(C20>0,C20/C39,\"Enter Incremental Cost\"))","v":"Enter Incremental Cost"},null,null,null,null,null,"WA",{"$f":"IF($C$4>=J47,K47,L47)","v":"August 1, 2020"},{"$f":"IF(C4<J31,\"WSEC 2012, Table 503.2.3(7)\",\"WSEC 2015, Table 503.2.3(7)\")","v":"WSEC 2015, Table 503.2.3(7)"},{"$f":"IF($C$4>=J47,M47,N47)","v":140}]
[null,null,null,null,null,null,null,null,"WY",{"$f":"IF($C$4>=J48,K48,L48)","v":"January 1, 2018"},"IECC 2009",{"$f":"IF($C$4>=J48,M48,N48)","v":140}]
[null,"Incentive Calculations"]
[null,"Available Incentive",{"$f":"IF(C11=\"Backup\",\"Back-up chillers are not eligibile for incentives\",IF(ISERROR(IF(OR(C36<0,C37<0),\"Does not Meet Efficiency Requirements\",IF(C20<>0,Incentive_Value,\"Enter Incremental Cost\"))),\"\",IF(OR(C36<0,C37<0),\"Does not Meet Efficiency Requirements\",IF(C20<>0,Incentive_Value,\"Enter Incremental Cost\"))))","v":"Enter Incremental Cost"},null,null,null,null,null,"State","Current Tariff Date","Current Text","Previous Text","Current Tariff Number","Previous","Current Date Text"]
[null,"Simple Payback After Incentives",{"$f":"IF(ISERROR(IF(C20>0,(C20-C43)/C39,\"Enter Incremental Cost\")),\"\",IF(C20>0,(C20-C43)/C39,\"Enter Incremental Cost\"))","v":"Enter Incremental Cost"},null,null,null,null,null,"CA","2015-05-01","May 1, 2015","January 19, 2012",140,"A-115","5/1/2015"]
[null,"1. Energy Savings Calculations use Base 65 Cooling Degree Days",null,null,null,null,null,null,"ID","2014-11-13","November 13, 2014","July 14, 2012",140,115,"7/14/2012"]
[null,null,null,null,null,null,null,null,"UT","2023-07-01","March 10, 2016","July 1, 2014",140,140,"3/10/2016"]
[null,null,null,null,null,null,null,null,"WA","2020-08-01","August 1, 2020","January 1, 2020",140,140,"8/1/2020"]
[null,null,null,null,null,null,null,null,"WY","2018-01-01","January 1, 2018","October 1, 2011",140,115,"12/1/2014"]
[]
[null,null,null,null,null,null,null,null,"Incentive Value","Incentive Per Unit"]
[null,null,null,null,null,null,null,null,{"$f":"IF(AND(InstallState=\"WY\",$C$4>=VLOOKUP(InstallState,$I$44:$J$48,2)),(0.15*ROUND(Annual_Energy_Savings,0)+(50*ROUND(Average_Monthly_Demand_Savings,0))),ROUND(Annual_Energy_Savings*Incentive_Per_Unit,0))","v":{"$error":"#N/A"}},{"$f":"IFERROR(INDEX(Incentives[Incentive Per Unit],MATCH(CONCATENATE(InstallState,\" - Active\"),Incentives[Active],0)),\"check install date\")","v":"check install date"}]
[]
[null,null,null,null,null,null,null,null,"State","Tariff Number","Text Date","Start Date","End Date","Active","Incentive Per Unit"]
[null,null,null,null,null,null,null,null,"WA",115,{"$f":"TEXT(Incentives[[#This Row],[Start Date]],\"mmmm d, yyyy\")","v":"January 1, 2014"},"2014-01-01","2018-01-01",{"$f":"CONCATENATE(Incentives[[#This Row],[State]],\" - \",IF(AND(InstallDate>=Incentives[[#This Row],[Start Date]],OR(InstallDate<Incentives[[#This Row],[End Date]],Incentives[[#This Row],[End Date]]=\"\")),\"Active\",\"Inactive\"))","v":"WA - Inactive"},0.12]
[null,null,null,null,null,null,null,null,"WA",140,{"$f":"TEXT(Incentives[[#This Row],[Start Date]],\"mmmm d, yyyy\")","v":"January 1, 2018"},"2018-01-01","2020-08-01",{"$f":"CONCATENATE(Incentives[[#This Row],[State]],\" - \",IF(AND(InstallDate>=Incentives[[#This Row],[Start Date]],OR(InstallDate<Incentives[[#This Row],[End Date]],Incentives[[#This Row],[End Date]]=\"\")),\"Active\",\"Inactive\"))","v":"WA - Inactive"},0.15]
[null,null,null,null,null,null,null,null,"WA",140,{"$f":"TEXT(Incentives[[#This Row],[Start Date]],\"mmmm d, yyyy\")","v":"August 1, 2020"},"2020-08-01",null,{"$f":"CONCATENATE(Incentives[[#This Row],[State]],\" - \",IF(AND(InstallDate>=Incentives[[#This Row],[Start Date]],OR(InstallDate<Incentives[[#This Row],[End Date]],Incentives[[#This Row],[End Date]]=\"\")),\"Active\",\"Inactive\"))","v":"WA - Inactive"},0.18]
[null,null,null,null,null,null,null,null,"CA","A-115",{"$f":"TEXT(Incentives[[#This Row],[Start Date]],\"mmmm d, yyyy\")","v":"January 19, 2012"},"2012-01-19","2015-05-01",{"$f":"CONCATENATE(Incentives[[#This Row],[State]],\" - \",IF(AND(InstallDate>=Incentives[[#This Row],[Start Date]],OR(InstallDate<Incentives[[#This Row],[End Date]],Incentives[[#This Row],[End Date]]=\"\")),\"Active\",\"Inactive\"))","v":"CA - Inactive"},0.12]
[null,null,null,null,null,null,null,null,"CA",140,{"$f":"TEXT(Incentives[[#This Row],[Start Date]],\"mmmm d, yyyy\")","v":"May 1, 2015"},"2015-05-01",null,{"$f":"CONCATENATE(Incentives[[#This Row],[State]],\" - \",IF(AND(InstallDate>=Incentives[[#This Row],[Start Date]],OR(InstallDate<Incentives[[#This Row],[End Date]],Incentives[[#This Row],[End Date]]=\"\")),\"Active\",\"Inactive\"))","v":"CA - Inactive"},0.15]
[null,null,null,null,null,null,null,null,"UT",140,{"$f":"TEXT(Incentives[[#This Row],[Start Date]],\"mmmm d, yyyy\")","v":"July 1, 2014"},"2014-07-01","2016-03-10",{"$f":"CONCATENATE(Incentives[[#This Row],[State]],\" - \",IF(AND(InstallDate>=Incentives[[#This Row],[Start Date]],OR(InstallDate<Incentives[[#This Row],[End Date]],Incentives[[#This Row],[End Date]]=\"\")),\"Active\",\"Inactive\"))","v":"UT - Inactive"},0.12]
[null,null,null,null,null,null,null,null,"UT",140,{"$f":"TEXT(Incentives[[#This Row],[Start Date]],\"mmmm d, yyyy\")","v":"March 10, 2016"},"2016-03-10",null,{"$f":"CONCATENATE(Incentives[[#This Row],[State]],\" - \",IF(AND(InstallDate>=Incentives[[#This Row],[Start Date]],OR(InstallDate<Incentives[[#This Row],[End Date]],Incentives[[#This Row],[End Date]]=\"\")),\"Active\",\"Inactive\"))","v":"UT - Inactive"},0.3]
[null,null,null,null,null,null,null,null,"ID",115,{"$f":"TEXT(Incentives[[#This Row],[Start Date]],\"mmmm d, yyyy\")","v":"July 14, 2012"},"2012-07-14","2014-11-13",{"$f":"CONCATENATE(Incentives[[#This Row],[State]],\" - \",IF(AND(InstallDate>=Incentives[[#This Row],[Start Date]],OR(InstallDate<Incentives[[#This Row],[End Date]],Incentives[[#This Row],[End Date]]=\"\")),\"Active\",\"Inactive\"))","v":"ID - Inactive"},0.12]
[null,null,null,null,null,null,null,null,"ID",140,{"$f":"TEXT(Incentives[[#This Row],[Start Date]],\"mmmm d, yyyy\")","v":"November 13, 2014"},"2014-11-13",null,{"$f":"CONCATENATE(Incentives[[#This Row],[State]],\" - \",IF(AND(InstallDate>=Incentives[[#This Row],[Start Date]],OR(InstallDate<Incentives[[#This Row],[End Date]],Incentives[[#This Row],[End Date]]=\"\")),\"Active\",\"Inactive\"))","v":"ID - Inactive"},0.15]
[null,null,null,null,null,null,null,null,"WY",115,{"$f":"TEXT(Incentives[[#This Row],[Start Date]],\"mmmm d, yyyy\")","v":"October 1, 2011"},"2011-10-01","2018-01-01",{"$f":"CONCATENATE(Incentives[[#This Row],[State]],\" - \",IF(AND(InstallDate>=Incentives[[#This Row],[Start Date]],OR(InstallDate<Incentives[[#This Row],[End Date]],Incentives[[#This Row],[End Date]]=\"\")),\"Active\",\"Inactive\"))","v":"WY - Inactive"},0.12]
[null,null,null,null,null,null,null,null,"WY",140,{"$f":"TEXT(Incentives[[#This Row],[Start Date]],\"mmmm d, yyyy\")","v":"January 1, 2018"},"2018-01-01",null,{"$f":"CONCATENATE(Incentives[[#This Row],[State]],\" - \",IF(AND(InstallDate>=Incentives[[#This Row],[Start Date]],OR(InstallDate<Incentives[[#This Row],[End Date]],Incentives[[#This Row],[End Date]]=\"\")),\"Active\",\"Inactive\"))","v":"WY - Inactive"},0.15]

{"sheet":"HELP","index":2,"n_rows":73,"n_cols":13,"rows_kept":73,"cut":false,"hidden":false,"merged":[[52,5,52,17],[52,3,52,4],[56,3,56,17],[54,2,54,17],[58,2,58,17],[60,3,60,17],[61,4,61,17],[62,4,62,17],[63,4,63,17],[64,4,64,17],[70,2,70,17],[65,4,65,17],[67,9,67,12],[68,9,68,12],[67,5,68,7],[67,8,68,8],[72,2,72,17],[22,4,22,17],[41,3,41,17],[39,2,39,17],[25,2,25,17],[31,2,31,6],[32,2,32,6],[33,2,33,6],[34,2,34,6],[35,2,35,6],[36,2,36,6],[37,2,37,6],[27,2,27,6],[28,2,28,6],[29,2,29,6],[30,2,30,6],[13,4,13,17],[14,4,14,17],[15,4,15,17],[51,2,51,4],[27,10,27,13],[45,3,45,17],[43,2,43,17],[47,2,47,17],[49,3,49,17],[50,4,50,17],[16,4,16,17],[17,4,17,17],[18,4,18,17],[19,4,19,17],[20,4,20,17],[21,4,21,17],[1,1,2,12],[1,13,2,18],[4,2,4,17],[7,2,7,17],[11,2,11,17],[9,2,9,17]]}
[]
[null,"Chiller Calculator Tool Help"]
[]
[]
[null,null,{"$f":"\"Note:  This chiller calculator is provided for the express use of \"&IF(InstallState=\"\",\"Rocky Mountain Power/Pacific Power approved EEA participants only. \",IF(OR(InstallState=\"ID\",InstallState=\"UT\",InstallState=\"WA\"),INDEX(Program_Name,MATCH(InstallState,StateAbrev_List,0))&\" approved wattsmart Business vendors only. \",INDEX(Program_Name,MATCH(InstallState,StateAbrev_List,0))&\" approved EEA participants only. \"))&\"Any other use of this chiller calculator tool is unauthorized unless specifically approved otherwise by \"&IF(InstallState=\"\",\"\",\"the \"&INDEX(Program_Name,MATCH(InstallState,StateAbrev_List,0))&\" Program Administrator or \")&IF(InstallState=\"\",\"Rocky Mountain Power/Pacific Power\",INDEX(UtilityName_List,MATCH(InstallState,StateAbrev_List,0)))&\".\"","v":"Note:  This chiller calculator is provided for the express use of Rocky Mountain Power/Pacific Power approved EEA participants only. Any other use of this chiller calculator tool is unauthorized unless specifically approved otherwise by Rocky Mountain Power/Pacific Power."}]
[]
[]
[null,null,"When to Use this Chiller Calculator"]
[]
[null,null,"This chiller calculator is designed to be used when a detailed energy analysis is not desired or time does not permit to complete one prior to the chiller installation. There are a number of assumptions made by the chiller calculator that may or may not be correct for the specific chiller at hand.  When in doubt as to whether or not it is appropriate to use this chiller calculator, please contact your EEA Coordinator at 1-801-300-0150.\n\nPlease note: Prescriptive incentives are only available for chillers used for HVAC loads and must meet all program requirements. "]
[]
[null,null,"How to Help Customers Obtain Incentives for a Chiller"]
[]
[null,null,null,"1.",{"$f":"\"Verify that the facility for the proposed chiller is served by \" & IF(InstallState=\"\",\"Rocky Mountain Power/Pacific Power\",INDEX(Lookups!$E$2:$E$6,MATCH(InstallState,Lookups!$D$2:$D$6,0))) & \" under one of the rate schedules eligible as listed in the applicable tariff. \" & IF(InstallState=\"\",\"\",InstallState &\"-\"& VLOOKUP(InstallState,ApplicableTariff,4))","v":"Verify that the facility for the proposed chiller is served by Rocky Mountain Power/Pacific Power under one of the rate schedules eligible as listed in the applicable tariff. "}]
[null,null,null,"2.","Determine the heat rejection (air or water cooled) for the proposed chiller."]
[null,null,null,"3.","Determine the type of the proposed chiller (Rotary, Screw, Scroll, Reciprocating, Centrifugal)"]
[null,null,null,"4.",{"$f":"\"Obtain performance specifications at AHRI rated conditions for the chiller manufacturer.  View the current version of the test procedure \n(AHRI Standard 550/590) at: \"","v":"Obtain performance specifications at AHRI rated conditions for the chiller manufacturer.  View the current version of the test procedure \n(AHRI Standard 550/590) at: "}]
[null,null,null,"5.","http://www.ahrinet.org/hvacr+industry+standards.aspx"]
[null,null,null,"6.","Fill out the yellow cells in the chiller calculator with all the requested information."]
[null,null,null,"7.","If the chiller qualifies for incentives, present and explain the estimate to the customer for review/acceptance/installation."]
[null,null,null,"8.","Retain a copy of the chiller calculator for your files."]
[null,null,null,"9.","Install the qualifying chiller for the customer."]
[null,null,null,"10.","Create an application by clicking the 'Create Incentive Application' button."]
[null,null,null,"11.","Submitt application by following the instructions found in the application."]
[]
[null,null,"Helpful Conversion Formulas"]
[]
[null,null,"KW/ton = 12 / EER ",null,null,null,null,null,null,null,"Conversion Calculator"]
[null,null,"KW/ton = 12 / (COP x 3.412) ",null,null,null,null,null,null,null,null,null,"kW/ton"]
[null,null,"COP = EER / 3.412 ",null,null,null,null,null,null,null,"Enter COP:",null,{"$f":"IF(L30=\"\",\"\",12/(L30*3.412))","v":""}]
[null,null,"COP = [12 / (KW/ton)] / 3.412 ",null,null,null,null,null,null,null,"Enter EER:",19.399999999999999,{"$f":"IF(L31=\"\",\"\",12/L31)","v":0.61855670103092786}]
[null,null,"EER = 12 / KW/ton "]
[null,null,"EER = COP x 3.412 "]
[null,null,"IPLV = .01A + .42B + .45C + .12D where:"]
[null,null,"A = kW/ton [EER or COP] at 100% load"]
[null,null,"B = kW/ton [EER or COP] at 75% load"]
[null,null,"C = kW/ton [EER or COP] at 50% load"]
[null,null,"D = kW/ton [EER or COP] at 25% load"]
[]
[null,null,"Incremental Cost above code baseline for proposed chiller ($)"]
[]
[null,null,null,"Incremental cost is the difference in cost between the proposed chiller and a similar code-level chiller.  For example, if the proposed chiller costs $170,000 and a similar code-level chiller costs $150,000, the incremental cost would be $20,000 ($170,000-$150,000).\n\nThe incremental cost is required to calculate payback results in the estimate.  This can help customers see how long it will take them to recuperate the extra investment required to buy an energy-efficient chiller. If you are having trouble calculating the incremental cost, please contact your EEA Coordinator for help by calling 1-801-300-0150."]
[]
[null,null,"Rate Schedule"]
[]
[null,null,null,{"$f":"\"The rate schedule is required to estimate paybacks.  The correct rate schedule found on the customer's current \" &  IF(InstallState=\"\",\"Rocky Mountain Power/Pacific Power\",INDEX(Lookups!$E$2:$E$6,MATCH(InstallState,Lookups!$D$2:$D$6,0))) & \" bill or call your EEA Coordinator at 1-866-415-9800 and request it.\"","v":"The rate schedule is required to estimate paybacks.  The correct rate schedule found on the customer's current Rocky Mountain Power/Pacific Power bill or call your EEA Coordinator at 1-866-415-9800 and request it."}]
[]
[null,null,"Select Nearest Weather Station"]
[]
[null,null,null,"The closer the weather station to your project location, the more accurate your estimates will be.  A map of the weather stations is available at the link below.  Click the state where the chiller is to be installed and hover over the weather station name on the left hand pane to see it's location on the map.  The location is highlighted."]
[null,null,null,null,"http://www.wrcc.dri.edu/summary/"]
[]
[null,null,null,"CAUTION:",null,{"$f":"\"A nearby weather station does not guarantee customer is served by \" & IF(InstallState=\"\",\"Rocky Mountain Power/Pacific Power\",INDEX(Lookups!$E$2:$E$6,MATCH(InstallState,Lookups!$D$2:$D$6,0))) & \".\"","v":"A nearby weather station does not guarantee customer is served by Rocky Mountain Power/Pacific Power."}]
[]
[null,null,"Compliance Path A vs. Path B"]
[]
[null,null,null,"Some energy codes have two paths of compliance for certain chiller types and sizes.  In these cases, Path A or B may be selected for the savings calculations. If Path B is not applicable, Path A must be selected."]
[]
[null,null,"Multiple Chiller Systems"]
[]
[null,null,null,"This calculator can be used on both single and multi-chiller systems.  Backup chillers are not eligible for incentives.  On multi-chiller systems, run the chiller calculator for each chiller in the system.  The project economics based on the results of the individual chiller calculators are calculated as follows:"]
[null,null,null,null,"Project Incentive:  add up the Incentive for each chiller in the system"]
[null,null,null,null,"Project Estimated Annual Cost Savings ($/year):  add up the Estimated Annual Cost Savings ($/year) for each chiller in the system"]
[null,null,null,null,"Project Estimated Annual Energy Savings (Kwh/year):  Add up the Estimated Annual Energy Savings (Kwh/year)  for each chiller in the system"]
[null,null,null,null,"Project Cost adder ($):  add up the Cost adder for proposed chiller ($)  for each chiller in the system"]
[null,null,null,null,"Project Simple Payback After Incentives (years):\n          Subtract the Project Incentive from the Project Cost adder and divide that by the Project Estimated Annual Cost Savings"]
[]
[null,null,null,null,null,"Simple Payback after Incentives",null,null,"=","Incremental Cost - Incentive"]
[null,null,null,null,null,null,null,null,null,"Annual Energy Cost Savings"]
[]
[null,null,"Additional Help"]
[]
[null,null,"Contact your EEA Coordinator for the wattsmart Business Program at 1-801-300-0150 with any questions you may have."]

{"sheet":"Application NEW","index":3,"n_rows":109,"n_cols":48,"rows_kept":109,"cut":false,"hidden":true,"merged":[[22,5,22,48],[105,33,106,47],[106,7,106,31],[108,7,108,31],[108,33,109,47],[94,5,94,24],[95,5,95,24],[96,5,96,24],[98,5,100,31],[98,33,98,47],[99,33,99,47],[100,33,104,47],[102,7,102,31],[104,7,104,31],[86,7,86,25],[87,7,87,25],[88,5,88,25],[89,5,91,25],[90,28,90,48],[91,28,93,48],[92,5,92,25],[93,5,93,25],[78,6,79,6],[78,7,79,25],[79,28,83,48],[80,7,80,25],[81,5,81,25],[82,7,82,25],[83,6,84,6],[83,7,84,25],[84,28,89,48],[85,7,85,25],[74,5,74,25],[75,7,75,25],[76,7,76,25],[77,7,77,25],[62,6,62,20],[62,22,62,36],[62,38,62,47],[65,5,65,48],[67,5,67,25],[67,28,78,48],[68,5,68,25],[69,7,69,25],[70,7,70,25],[71,7,71,25],[72,7,73,25],[56,5,56,28],[56,29,56,48],[58,5,58,48],[59,5,59,48],[60,5,60,48],[61,6,61,20],[61,22,61,36],[61,38,61,47],[54,5,54,28],[54,29,54,38],[54,39,54,43],[54,44,54,48],[55,5,55,28],[55,29,55,48],[51,5,51,48],[52,5,52,48],[53,5,53,28],[53,29,53,38],[53,39,53,43],[53,44,53,48],[40,20,47,47],[41,7,41,18],[43,7,43,18],[45,7,45,18],[47,7,47,18],[50,5,50,48],[35,5,36,15],[35,16,36,28],[35,29,35,48],[36,29,36,48],[37,5,37,48],[39,7,39,18],[39,20,39,47],[32,5,32,28],[32,29,32,38],[32,39,32,43],[32,44,32,48],[33,5,34,15],[33,16,34,38],[33,39,34,43],[33,44,34,48],[28,5,28,48],[29,5,29,48],[30,5,30,48],[31,5,31,28],[31,29,31,38],[31,39,31,43],[31,44,31,48],[23,5,23,30],[23,31,23,48],[24,5,24,48],[25,7,25,15],[25,17,25,24],[25,26,25,30],[25,32,25,36],[25,38,25,42],[25,44,25,48],[18,5,18,28],[18,29,18,48],[19,5,19,16],[19,17,19,27],[19,29,19,48],[20,5,20,16],[20,17,20,28],[20,29,20,48],[16,5,16,28],[16,29,16,38],[16,39,16,43],[16,44,16,48],[17,5,17,28],[17,29,17,48],[9,5,9,48],[10,5,10,48],[11,5,11,17],[13,5,13,48],[14,5,14,48],[15,5,15,28],[15,29,15,38],[15,39,15,43],[15,44,15,48]]}
[]
[]
[]
[]
[]
[null,null,null,null,null,"General Application"]
[]
[]
[]
[null,null,null,null,null,"PARTICIPANT INFORMATION"]
[null,null,null,null,null,"(Check will be issued to the business name and address listed below unless the payment release section below has been filled out)"]
[null,null,null,null,null,"Participant is (check all that apply)",null,null,null,null,null,null,null,null,null,null,null,null,{"$f":"IF(CheckBoxLink_AccountHolder=TRUE,\"X\",\"\")","v":""},"Customer",null,null,null,null,null,{"$f":"IF(CheckBoxLink_FacilityOwner=TRUE,\"X\",\"\")","v":""},"Facility Owner",null,null,null,null,null,{"$f":"IF(CheckBoxLink_ElectricityUser=TRUE,\"X\",\"\")","v":""},"Tenant/Electricity user"]
[null,null,null,null,null,null,null,null,null,null,null,null,null,null,null,null,null,null,false,null,null,null,null,null,null,false,null,null,null,null,null,null,false]
[null,null,null,null,null,"Participant business name (As shown on income tax return):"]
[null,null,null,null,null,{"$f":"CustomerBusinessName","v":0}]
[null,null,null,null,null,"Mailing address:",null,null,null,null,null,null,null,null,null,null,null,null,null,null,null,null,null,null,null,null,null,null,null,"City:",null,null,null,null,null,null,null,null,null,"State:",null,null,null,null,"Zip:"]
[null,null,null,null,null,{"$f":"CustomerAddress","v":0},null,null,null,null,null,null,null,null,null,null,null,null,null,null,null,null,null,null,null,null,null,null,null,{"$f":"CustomerCity","v":0},null,null,null,null,null,null,null,null,null,{"$f":"CustomerState","v":0},null,null,null,null,{"$f":"CustomerZip","v":0}]
[null,null,null,null,null,"Contact name:",null,null,null,null,null,null,null,null,null,null,null,null,null,null,null,null,null,null,null,null,null,null,null,"Contact title:"]
[null,null,null,null,null,{"$f":"CustomerContactName","v":0},null,null,null,null,null,null,null,null,null,null,null,null,null,null,null,null,null,null,null,null,null,null,null,{"$f":"CustomerContactTitle","v":0}]
[null,null,null,null,null,"Contact telephone number:",null,null,null,null,null,null,null,null,null,null,null,"Cell number:",null,null,null,null,null,null,null,null,null,null,false,"Contact email address:"]
[null,null,null,null,null,{"$f":"IF(CheckboxLink_CellPhone=FALSE,CustomerContactPhone,0)","v":0},null,null,null,null,null,null,null,null,null,null,null,{"$f":"IF(CheckboxLink_CellPhone=TRUE,CustomerContactPhone,0)","v":0},null,null,null,null,null,null,null,null,null,null,null,{"$f":"CustomerContactEmail","v":0}]
[]
[null,null,null,null,null,"TAXPAYER IDENTIFICATION (Must be complete in order to receive an incentive)"]
[null,null,null,null,null," Participant Federal taxpayer ID number (EIN) or SS#:",null,null,null,null,null,null,null,null,null,null,null,null,null,null,null,null,null,null,null,null,null,null,null,null,null,"____ ____ ____ ____ ____ ____ ____ ____ ____"]
[null,null,null,null,null,"Please check the appropriate box:"]
[null,null,null,null,null,null,null,"Individual or Sole Proprietor",null,null,null,null,null,null,null,null,null,"LLC, LLP, or Partnership",null,null,null,null,null,null,null,null,"C Corporation",null,null,null,null,null,"S Corporation",null,null,null,null,null,"Trust/Estate",null,null,null,null,null,"Exempt Payee"]
[]
[]
[null,null,null,null,null,"PROJECT SITE INFORMATION"]
[null,null,null,null,null,"Facility/Project name:"]
[null,null,null,null,null,{"$f":"ProjectName","v":0}]
[null,null,null,null,null,"Facility address:",null,null,null,null,null,null,null,null,null,null,null,null,null,null,null,null,null,null,null,null,null,null,null,"City:",null,null,null,null,null,null,null,null,null,"State:",null,null,null,null,"Zip:"]
[null,null,null,null,null,{"$f":"InstallAddress","v":0},null,null,null,null,null,null,null,null,null,null,null,null,null,null,null,null,null,null,null,null,null,null,null,{"$f":"InstallCity","v":0},null,null,null,null,null,null,null,null,null,{"$f":"InstallState","v":0},null,null,null,null,{"$f":"InstallZip","v":0}]
[null,null,null,null,null,"Commercial/Industrial electric account #:",null,null,null,null,null,null,null,null,null,null,{"$f":"AccountNumber","v":0},null,null,null,null,null,null,null,null,null,null,null,null,null,null,null,null,null,null,null,null,null,null,"Rate Schedule:",null,null,null,null,{"$f":"RateSchedule","v":0}]
[]
[null,null,null,null,null,"Electric meter number – seven or eight digits: (If multiple meters at site only enter one)",null,null,null,null,null,null,null,null,null,null,{"$f":"MeterNumber","v":0},null,null,null,null,null,null,null,null,null,null,null,null,"Customer name: (As shown on bill)"]
[null,null,null,null,null,null,null,null,null,null,null,null,null,null,null,null,null,null,null,null,null,null,null,null,null,null,null,null,null,{"$f":"AccountName","v":0}]
[null,null,null,null,null,"Please provide a description of your project so we may better help you: "]
[]
[null,null,null,null,null,null,null,"Lighting Retrofit",null,null,null,null,null,null,null,null,null,null,null,null,"Additional project information: (scope and schedule)"]
[]
[null,null,null,null,null,null,"X","Listed Equipment Incentives"]
[]
[null,null,null,null,null,null,{"$f":"IF(OR(ProjectType=\"New Construction\",ProjectType=\"Major Renovation\"),\"X\",\"\")","v":""},"New Construction"]
[]
[null,null,null,null,null,null,null,"Custom or Energy Management Incentives"]
[]
[null,null,null,null,null,null,null,"Other:________________________________"]
[]
[]
[null,null,null,null,null,"INCENTIVE ASSIGNMENT (Complete only if incentive is to be assigned to someone other than participant above)"]
[null,null,null,null,null,"Check should be made out to:"]
[null,null,null,null,null,{"$f":"IF(OR(IncentivePayeeSelector=\"Participant Business Address\",IncentivePayeeSelector=\"Project Address\"),\"n/a\",PayeeBusinessName)","v":0}]
[null,null,null,null,null,"Mailing address:",null,null,null,null,null,null,null,null,null,null,null,null,null,null,null,null,null,null,null,null,null,null,null,"City:",null,null,null,null,null,null,null,null,null,"State:",null,null,null,null,"Zip:"]
[null,null,null,null,null,{"$f":"IF(OR(IncentivePayeeSelector=\"Participant Business Address\",IncentivePayeeSelector=\"Project Address\"),\"n/a\",PayeeAddress)","v":0},null,null,null,null,null,null,null,null,null,null,null,null,null,null,null,null,null,null,null,null,null,null,null,{"$f":"IF(OR(IncentivePayeeSelector=\"Participant Business Address\",IncentivePayeeSelector=\"Project Address\"),\"n/a\",PayeeCity)","v":0},null,null,null,null,null,null,null,null,null,{"$f":"IF(OR(IncentivePayeeSelector=\"Participant Business Address\",IncentivePayeeSelector=\"Project Address\"),\"n/a\",PayeeState)","v":0},null,null,null,null,{"$f":"IF(OR(IncentivePayeeSelector=\"Participant Business Address\",IncentivePayeeSelector=\"Project Address\"),\"n/a\",PayeeZip)","v":0}]
[null,null,null,null,null,"Contact name:",null,null,null,null,null,null,null,null,null,null,null,null,null,null,null,null,null,null,null,null,null,null,null,"Contact telephone:"]
[null,null,null,null,null,{"$f":"IF(OR(IncentivePayeeSelector=\"Participant Business Address\",IncentivePayeeSelector=\"Project Address\"),\"n/a\",PayeeContactName)","v":0},null,null,null,null,null,null,null,null,null,null,null,null,null,null,null,null,null,null,null,null,null,null,null,{"$f":"IF(OR(IncentivePayeeSelector=\"Participant Business Address\",IncentivePayeeSelector=\"Project Address\"),\"n/a\",PayeeContactPhone)","v":0}]
[]
[null,null,null,null,null,"APPLICATION ACKNOWLEDGEMENT"]
[null,null,null,null,null,{"$f":"\"By my signature below, I certify that all information provided for participation will be accurate including but not limited to supplemental material and claims of \" & \"participant and equipment information. I confirm I have read, understand and agree with the TERMS AND CONDITIONS and agree to be bound by them. I authorize \" & INDEX(UtilityName_List,MATCH(InstallState,StateAbrev_List,0)) & \" to provide my electric account information to consultants associated with the wattsmart Business program.\"","v":{"$error":"#N/A"}}]
[null,null,null,null,null,"                                                                            Under penalties of perjury, I certify that: 1) The taxpayer identification number is correct, and 2) I am not subject to backup withholding due to failure to report interest and dividend income, and 3) I am a U.S. citizen, resident alien or other U.S. person. The Internal Revenue Service does not require your consent to any provision of this document other than the certifications required to avoid backup withholding."]
[]
[null,null,null,null,null,null,"Signatory name & title (please print)",null,null,null,null,null,null,null,null,null,null,null,null,null,null,null,"Participant signature",null,null,null,null,null,null,null,null,null,null,null,null,null,null,null,"Date"]
[null,null,null,null,null,null,{"$f":"\"Effective \" & VLOOKUP(InstallState,'Chiller Calculator'!$I$44:$O$48,7,FALSE) & \"    v12/23/2013\"","v":{"$error":"#N/A"}},null,null,null,null,null,null,null,null,null,null,null,null,null,null,null,null,null,null,null,null,null,null,null,null,null,null,null,null,null,null,null,null,null,null,null,null,null,null,null,null,"wattsmart is registered in U.S. Patent and Trademark Office."]
[]
[null,null,null,null,null,"TERMS & CONDITIONS"]
[]
[null,null,null,null,null,"How to participate:",null,null,null,null,null,null,null,null,null,null,null,null,null,null,null,null,null,null,null,null,null,null,{"$f":"INDEX(UtilityName_List,MATCH(InstallState,StateAbrev_List,0)) & \" does not warrant the performance of qualifying installed equipment/energy management measures and does not warrant that the qualifying installed equipment/energy management measures will deliver any specified amount of energy or cost savings. \" & \"Participant shall independently evaluate any advice or direction given by \" & INDEX(UtilityName_List,MATCH(InstallState,StateAbrev_List,0)) & \" or its consultants related to the estimates of electricity savings or the cost, selection or installation of qualifying equipment/energy management measures. \" & \"In no event will \" & INDEX(UtilityName_List,MATCH(InstallState,StateAbrev_List,0)) & \" or its consultants be liable for the failure of the participant to achieve its expected amount of energy savings, for any personal injury or harm to participant’s facilities of any kind, \" & \"or for any incidental or consequential damages of any kind including hazardous material identification in connection with installation or inspection of qualifying equipment and energy management measures. \" & INDEX(UtilityName_List,MATCH(InstallState,StateAbrev_List,0)) & \" is not responsible if a third party provides inaccurate information about the amount and/or conditions of the actual incentive and \" & INDEX(UtilityName_List,MATCH(InstallState,StateAbrev_List,0)) & \" will not pay incentives for equipment that is mislabeled or misrepresented by third parties regarding incentive qualifications.\"","v":{"$error":"#N/A"}}]
[null,null,null,null,null,"Typical incentives:"]
[null,null,null,null,null,null,"1.","Pre-qualification is recommended but not required."]
[null,null,null,null,null,null,"2.","Purchase and install qualifying equipment."]
[null,null,null,null,null,null,"3.","Complete general application and technology-specific supplemental equipment form(s)."]
[null,null,null,null,null,null,"4.","Submit application and all required supplemental forms as directed on supplemental form(s)."]
[]
[null,null,null,null,null,"Lighting retrofit incentives: "]
[null,null,null,null,null,null,"1.","Pre-qualification is required prior to equipment purchase. Submit general application to your assigned Project Manager or one of our wattsmart Business vendors."]
[null,null,null,null,null,null,"2.","Participate in inspections prior to the installation or removal of any equipment."]
[null,null,null,null,null,null,"3.","Incentive offer will be provided to eligible participants. \nReturn signed incentive offer."]
[null,null,null,null,null,null,"4.","Complete project and notify your assigned Project Manager or wattsmart Vendor."]
[null,null,null,null,null,null,null,null,null,null,null,null,null,null,null,null,null,null,null,null,null,null,null,null,null,null,null,null,{"$f":"\"                             \" & \"The incentive offer is an estimate. The final incentive will be based on actual electric savings and approved actual project costs incurred by the participant for implemented approved energy efficiency measures. \" & \"Participant agrees to provide any reasonable documentation to allow \" & INDEX(UtilityName_List,MATCH(InstallState,StateAbrev_List,0)) & \" to determine electric savings and actual costs incurred. To the extent that \" & INDEX(UtilityName_List,MATCH(InstallState,StateAbrev_List,0)) & \" determines (at its sole discretion) that any of the recommended measures have not been installed and commissioned in a satisfactory manner, \" & \"participant shall receive a reduced incentive, if any, based on the inspection and verification of installed and commissioned measures.\"","v":{"$error":"#N/A"}}]
[null,null,null,null,null,null,"5.","Provide all required documentation and participate in any required inspections."]
[null,null,null,null,null,"Custom and energy management incentives: "]
[null,null,null,null,null,null,"1.","Pre-qualification is required prior to equipment purchase/project implementation. Submit general application."]
[null,null,null,null,null,null,"2.","Participate in project scoping meeting(s), inspections and engineering analysis(s) prior to installation or removal of equipment. Provide additional supplemental applications or information as needed."]
[null,null,null,null,null,null,null,null,null,null,null,null,null,null,null,null,null,null,null,null,null,null,null,null,null,null,null,null,{"$f":"\"                                                                       \" & \"Participant hereby transfers to \" & INDEX(UtilityName_List,MATCH(InstallState,StateAbrev_List,0)) & \" all \"\"Environmental Attributes\"\" attributable to the installation of the qualifying equipment or its operation. \" & \"Environmental Attributes include any and all credits, benefits, emissions reductions, offsets and allowances, howsoever entitled, resulting from the avoidance of the emission of any substance to the air, \" & \"soil or water at or by the company’s generating facilities, through reduced generation of energy or other savings or offsets on account of the qualifying equipment.  \" & \"Participant will not claim ownership of any Environmental Attributes.  \" & \"As long as participant at the same time states the installation of the qualifying equipment was made possible with funding from \" & INDEX(UtilityName_List,MATCH(InstallState,StateAbrev_List,0)) & \", participant may claim that it is facilitating the production of the Environmental Attributes attributable to the qualifying equipment.\"","v":{"$error":"#N/A"}}]
[null,null,null,null,null,null,"3.","Incentive offer(s) will be provided to eligible participants. Return signed incentive offer."]
[null,null,null,null,null,null,"4.","Complete project and provide completion notification to your assigned Project Manager."]
[null,null,null,null,null,null,"5.","Provide all required documentation and participate in any required inspections."]
[null,null,null,null,null,{"$f":"\"                                                                     \" & \"In the event that \" & INDEX(UtilityName_List,MATCH(InstallState,StateAbrev_List,0)) & \" does not pay the incentive as a result of the participant’s failure to comply with the terms and conditions, the assignee’s sole recourse shall be against participant.\"","v":{"$error":"#N/A"}}]
[null,null,null,null,null,{"$f":"\"                                               \" & \"Participant agrees to cooperate with \" & INDEX(UtilityName_List,MATCH(InstallState,StateAbrev_List,0)) & \" and its consultants to conduct energy analysis and inspections at the participant's site. \" & INDEX(UtilityName_List,MATCH(InstallState,StateAbrev_List,0)) & \" reserves the right to inspect qualifying equipment/energy management measures, which may include a telephone survey, site visit, \" & \"and/or the installation of temporary monitoring equipment at any time up to 36 months after installation for quality control or program performance evaluations.\"","v":{"$error":"#N/A"}}]
[null,null,null,null,null,null,null,null,null,null,null,null,null,null,null,null,null,null,null,null,null,null,null,null,null,null,null,null,{"$f":"\"                                   \" & \"Incentive qualifications and amounts are subject to change and termination. \" & \"Visit the program’s website or contact a wattsmart Business vendor or \" & INDEX(UtilityName_List,MATCH(InstallState,StateAbrev_List,0)) & \" for current program information.\"","v":{"$error":"#N/A"}}]
[null,null,null,null,null,null,null,null,null,null,null,null,null,null,null,null,null,null,null,null,null,null,null,null,null,null,null,null,{"$f":"\"                                                \" & \"Confidential information provided to \" & INDEX(UtilityName_List,MATCH(InstallState,StateAbrev_List,0)) & \" or consultants shall not be disclosed to any third party. Confidential information shall mean data disclosed during the course of the energy analysis, \" & \"and identified by the participant in writing as confidential. The obligation to protect confidential information will remain in force for two (2) years from the date the energy analysis is performed.\"","v":{"$error":"#N/A"}}]
[null,null,null,null,null,{"$f":"\"                         \" & \"Neither \" & INDEX(UtilityName_List,MATCH(InstallState,StateAbrev_List,0)) & \" nor its Program Administrator is providing tax advice or responsible for any tax liability which may be imposed on the participant as a result of any incentive payment. \" & \"Participant may be responsible for the tax reporting to the IRS of any incentive payments directed to third parties.\"","v":{"$error":"#N/A"}}]
[null,null,null,null,null,{"$f":"\"                                                                                        \" & \"Participants may not receive custom incentives in lieu of typical (listed) incentives. \" & \"Participants are responsible for ensuring that equipment installed for this program meets all applicable codes, standards, environmental regulations and regulatory requirements.\"","v":"                                                                                        Participants may not receive custom incentives in lieu of typical (listed) incentives. Participants are responsible for ensuring that equipment installed for this program meets all applicable codes, standards, environmental regulations and regulatory requirements."}]
[]
[null,null,null,null,null,"Application Supplemental"]
[null,null,null,null,null,"HVAC - Chiller"]
[]
[null,null,null,null,null,"To apply for wattsmart Business incentives, complete this application supplement and send it with the general incentive application to the address to the right. Please review and confirm each of the qualifying criteria below, as applicable.",null,null,null,null,null,null,null,null,null,null,null,null,null,null,null,null,null,null,null,null,null,null,null,null,null,null,null,"Send completed application by email, mail, or fax to:"]
[null,null,null,null,null,null,null,null,null,null,null,null,null,null,null,null,null,null,null,null,null,null,null,null,null,null,null,null,null,null,null,null,null,{"$f":"INDEX(HVACEmail_List,MATCH(InstallState,StateAbrev_List,0))","v":{"$error":"#N/A"}}]
[null,null,null,null,null,null,null,null,null,null,null,null,null,null,null,null,null,null,null,null,null,null,null,null,null,null,null,null,null,null,null,null,null,{"$f":"\"wattsmart Business\n\" &\nINDEX(MailAddress1_List,MATCH(InstallState,StateAbrev_List,0)) & \"\n\" &\nINDEX(MailCity_List,MATCH(InstallState,StateAbrev_List,0)) & \", \" & INDEX(MailState,MATCH(InstallState,StateAbrev_List,0)) & \"  \" & INDEX(MailZip_List,MATCH(InstallState,StateAbrev_List,0))","v":{"$error":"#N/A"}}]
[]
[null,null,null,null,null,null,null,"Equipment is installed and operating at the site listed on the general application."]
[]
[null,null,null,null,null,null,null,"The dated sales receipt or invoice is included with labor and material costs itemized."]
[null,null,null,null,null,null,null,null,null,null,null,null,null,null,null,null,null,null,null,null,null,null,null,null,null,null,null,null,null,null,null,null,null,{"$f":"INDEX(ApplyToFaxNL_List,MATCH(InstallState,StateAbrev_List,0)) & \" - fax\"","v":{"$error":"#N/A"}}]
[null,null,null,null,null,null,null,"Manufacturer’s specification sheet for each installed equipment model is included."]
[]
[null,null,null,null,null,null,null,"Completed application is submitted within six months of project completion.",null,null,null,null,null,null,null,null,null,null,null,null,null,null,null,null,null,null,null,null,null,null,null,null,null,"For additional information or assistance,\nplease call 1-866-415-9800"]

{"sheet":"Lookups","index":4,"n_rows":75,"n_cols":88,"rows_kept":75,"cut":false,"hidden":true,"merged":[]}
["Year","YearPlusOne","StateName","StateAbrev","UtilityName","UtilityWebsite","AllianceWebsite","UtilityHotline","FXHotline","UtilityEmail","UtilityFax","VersionNmbr","ApplicationVersionNmber","EffectiveDate","CustInct","CustCap","HVACEmail","MotorsEmail","FoodServiceEmail","IrrigationEmail","BldgEnvEmail","LightingEmail","CompAirEmail","FarmDairyEmail","OtherEmail","NLApplicationEmail","RateSchedule","MailAddress1","MailAddress2","MailCity","MailState","MailZip","States","OtherUtilityName","State1","State2","State3","State1Abb","State2Abb","State3Abb","ST1_RT_Schedule","ST2_RT_Schedule","ST3_RT_Schedule","ST1_CRD Name","ST1_CRD Info","ST1_CRD Number","ST1_CRD Email","ST2_CRD Name","ST2_CRD Number","ST2_CRD Info","ST2_CRD Email","ST3_CRD Name","ST3_CRD Number","ST3_CRD Info","ST3_CRD Email","Costpercentage","Purchase Directions","Purchase Directions","NC/MR Pre Purchase Directions","Letter of intent Note","Retrofit Directions","IA Retrofit Directions","Other Utility Directions","St1RetroLightingProcess","St1NCMRLightingProcess","St1NonlightProcess","St1CustomProcess","St2RetroLightingProcess","St2NCMRLightingProcess","St2NonlightProcess","St2CustomProcess","St3RetroLightingProcess","St3NCMRLightingProcess","St3NonlightProcess","St3CustomProcess","HESWebsite","ST1FinAnswerWebsite","ST2FinAnswerWebsite","ST3FinAnswerWebsite","BSTWebsite","EmailSuffix","EnergyCodeBaseline","CodeEffDate","AbbreviatedCode","Tariff #","ApplyToFaxNL","ApplyToFaxLtg","Program name"]
[2014,{"$f":"A2+1","v":2015},"Utah","UT","Rocky Mountain Power","wattsmart.com","rockymountainpower.net/alliance","1-800-222-4335","1-866-415-9800","energy.expert@rockymountainpower.net","801-233-0883","V 11/14/12","V 07/01/13","2013-07-01",0.1,50,"ut.hvacr@rockymountainpower.net","ut.motors@rockymountainpower.net","ut.foodservice@rockymountainpower.net","ut.irrigation@rockymountainpower.net","ut.bldgenvelope@rockymountainpower.net","ut.lighting@rockymountainpower.net","ut.compair@rockymountainpower.net","ut.farmdairy@rockymountainpower.net","ut.othertech@rockymountainpower.net","ut.finanswerexpress@rockymountainpower.net","6, 6A, 6B, 8, 9, 9A, 10, 12, 15, 21, 23, Supplementary service under Schedule 31","2223 S Highland Drive #E6-333",null,"Salt Lake City","UT",84106,"Utah, Wyoming and Idaho","Pacific Power","Utah","Wyoming","Idaho","UT","WY","ID","6, 6A, 6B, 8, 9, 9A, 10, 12, 15, 21, 23, Supplementary service under Schedule 31","25, 28, 33, 40, 46, 48, 54, 58, 210, 212, 213","6, 6A, 8, 9, 12, 19, 23, 23A, 24, 35, 35A","Mark Clary",null,"801.233.0882","ut.lighting@rockymountainpower.net","Jim Soukup","307.235.0438",null,"wy.lighting@rockymountainpower.net","William Gatchel","541.727.5386",null,"id.lighting@rockymountainpower.net",50,"Lighting retrofits must have a signed incentive agreement prior to purchase of equipment",null,null,null,null,null,null,"Pre-purchase Agreement","Post-purchase Application","Post-purchase Application","Pre-purchase Agreement","Pre-purchase Agreement","Post-purchase Application","Post-purchase Application","Pre-purchase Agreement","Pre-purchase Agreement","Post-purchase Application","Post-purchase Application","Pre-purchase Agreement","www.homeenergysavings.net","www.rockymountainpower.net/bus/se/epi/utah/ilc/ef.html","www.rockymountainpower.net/bus/se/epi/wyoming/ilc/ef.html","www.rockymountainpower.net/bus/se/epi/idaho/ilc/ef.html","www.rockymountainpower.net/bus/bst.html","@rockymountainpower.net","International Energy Conservation Code 2009","2010-07-01","IECC 2009",140,"1-801-266-4786","1-801-233-0883","wattsmart Business"]
[2014,{"$f":"A3+1","v":2015},"Wyoming","WY","Rocky Mountain Power","rockymountainpower.net/wattsmart","rockymountainpower.net/alliance","1-800-222-4335","1-866-415-9800","energy.expert@rockymountainpower.net","307-333-4952","V 10/01/11","V 01/01/13","2011-10-01",0.1,70,"wy.hvacr@rockymountainpower.net","wy.motors@rockymountainpower.net","wy.foodservice@rockymountainpower.net","wy.irrigation@rockymountainpower.net","wy.bldgenvelope@rockymountainpower.net","wy.lighting@rockymountainpower.net","wy.compair@rockymountainpower.net","wy.farmdairy@rockymountainpower.net","wy.othertech@rockymountainpower.net","wy.finanswerexpress@rockymountainpower.net","25, 28, 33, 40, 46, 48T, 54, 58, 210, 212, 213","2223 S Highland Drive #E6-333",null,"Salt Lake City","UT",84106,"Utah, Wyoming and Idaho","Pacific Power","Utah","Wyoming","Idaho","UT","WY","ID","6, 6A, 6B, 8, 9, 9A, 10, 12, 15, 21, 23, Supplementary service under Schedule 31","25, 28, 33, 40, 46, 48, 54, 58, 210, 212, 213","6, 6A, 8, 9, 12, 19, 23, 23A, 24, 35, 35A","Mark Clary",null,"801.233.0882","ut.lighting@rockymountainpower.net","Jim Soukup","307.235.0438",null,"wy.lighting@rockymountainpower.net","William Gatchel","541.727.5386",null,"id.lighting@rockymountainpower.net",50,null,null,null,null,null,null,null,"Pre-purchase Agreement","Post-purchase Application","Post-purchase Application","Pre-purchase Agreement","Pre-purchase Agreement","Post-purchase Application","Post-purchase Application","Pre-purchase Agreement","Pre-purchase Agreement","Post-purchase Application","Post-purchase Application","Pre-purchase Agreement","www.homeenergysavings.net","www.rockymountainpower.net/bus/se/epi/utah/ilc/ef.html","www.rockymountainpower.net/bus/se/epi/wyoming/ilc/ef.html","www.rockymountainpower.net/bus/se/epi/idaho/ilc/ef.html","www.rockymountainpower.net/bus/bst.html","@rockymountainpower.net","International Energy Conservation Code 2009","December 1, 2014 (as determined by Rocky Mountain Power)","IECC 2009",140,"1-801-266-4787","1-541-376-8446","wattsmart Business"]
[2014,2015,"Idaho","ID","Rocky Mountain Power","rockymountainpower.net/wattsmart","rockymountainpower.net/alliance","1-800-222-4335","1-866-415-9800","energy.expert@rockymountainpower.net","541-376-8446","V 07/14/12","V 01/01/13","2012-07-14",0.1,50,"id.hvacr@rockymountainpower.net","id.motors@rockymountainpower.net","id.foodservice@rockymountainpower.net","id.irrigation@rockymountainpower.net","id.bldgenvelope@rockymountainpower.net","id.lighting@rockymountainpower.net","id.compair@rockymountainpower.net","id.farmdairy@rockymountainpower.net","id.othertech@rockymountainpower.net","id.finanswerexpress@rockymountainpower.net","6, 6A, 7, 7A, 9, 12, 19, 23, 23A, 24, 35, 35A","2223 S Highland Drive #E6-333",null,"Salt Lake City","UT",84106,"Utah, Wyoming and Idaho","Pacific Power","Utah","Wyoming","Idaho","UT","WY","ID","6, 6A, 6B, 8, 9, 9A, 10, 12, 15, 21, 23, Supplementary service under Schedule 31","25, 28, 33, 40, 46, 48, 54, 58, 210, 212, 213","6, 6A, 7, 7A, 9, 12, 19, 23, 23A, 24, 35, 35A","Mark Clary",null,"801.233.0882","ut.lighting@rockymountainpower.net","Jim Soukup","307.235.0438",null,"wy.lighting@rockymountainpower.net","William Gatchel","541.727.5386",null,"id.lighting@rockymountainpower.net",50,null,null,null,null,null,null,null,"Pre-purchase Agreement","Post-purchase Application","Post-purchase Application","Pre-purchase Agreement","Pre-purchase Agreement","Post-purchase Application","Post-purchase Application","Pre-purchase Agreement","Pre-purchase Agreement","Post-purchase Application","Post-purchase Application","Pre-purchase Agreement","www.homeenergysavings.net","www.rockymountainpower.net/bus/se/epi/utah/ilc/ef.html","www.rockymountainpower.net/bus/se/epi/wyoming/ilc/ef.html","www.rockymountainpower.net/bus/se/epi/idaho/ilc/ef.html","www.rockymountainpower.net/bus/bst.html","@rockymountainpower.net","International Energy Conservation Code 2009","2011-01-01","IECC 2009",140,"1-801-266-4788","1-503-482-7447","wattsmart Business"]
[2014,{"$f":"A5+1","v":2015},"California","CA","Pacific Power","pacificpower.net/wattsmart","pacificpower.net/alliance","1-800-222-4335","1-866-415-9800","energy.expert@pacificpower.net","(541) 770-2731","V 01/19/12","V 01/01/13","2012-01-19",0.1,70,"ca.hvacr@pacificpower.net","ca.motors@pacificpower.net","ca.foodservice@pacificpower.net","ca.irrigation@pacificpower.net","ca.bldgenvelope@pacificpower.net","ca.lighting@pacificpower.net","ca.compair@pacificpower.net","ca.farmdairy@pacificpower.net","ca.othertech@pacificpower.net","ca.finanswerexpress@pacificpower.net","A-25, A-32, A-33, A-36, AT-47, AT-48, LS-53, LS-58, OL-42, PA-20","6312 SW Capitol Way #1023",null,"Portland","OR",97239,"California and Washington","Rocky Mountain Power","California","Washington",null,"CA","WA",null,"A-25, A-32, A-33, A-36, AT-47, AT-48, AWH-31, LS-53, LS-58, OL-42, PA-20, PA-40","24, 33, 36, 40, 47T, 48T, 54",null,"Bob Greeley",null,"541.601.8088","ca.lighting@pacificpower.net","Lori Sanders","509.727.0394","- Yakima","wa.lighting@pacificpower.net","William Gatchel","541.377.7943","- Walla Walla","wa.lighting@pacificpower.net",60,"Lighting retrofits in Washington must have a signed incentive agreement prior to purchase of equipment.   Lighting retrofits in California may be done post-purchase, but pre-approval is recommended.",null,"Note that pre-purchase incentive agreements are only required in Washington for retrofit projects. Incentive Agreements and Letters of Intent are NOT required for any projects in California or for any New Construction/Major Renovation projects","Note: Letter of Intent is only required for retrofit projects in California.","For Washington retrofit projects, instruct customer not to purchase equipment until an incentive agreement is executed.","For retrofit projects (except in California), the incentive agreement must be signed BEFORE the customer signs purchase orders or installation contracts for the project.","For information on Rocky Mountain Power customer incentives in Oregon, contact the Energy Trust of Oregon at www.energytrust.org. ","Post-purchase Application","Post-purchase Application","Post-purchase Application","Pre-purchase Agreement","Pre-purchase Agreement","Post-purchase Application","Post-purchase Application","Pre-purchase Agreement",null,null,null,null,"www.homeenergysavings.net","www.pacificpower.net/bus/se/epi/california/ilc/ef.html","www.pacificpower.net/bus/se/epi/washington/ilc/ef.html",null,"www.pacificpower.net/bus/bst/index.html","@pacificpower.net","2008 Building Efficiency Standards","2010-01-01","Title 24 2008",140,"1-503-482-7447","1-503-482-7447","wattsmart Business"]
[2014,{"$f":"A6+1","v":2015},"Washington","WA","Pacific Power","bewattsmart.com","pacificpower.net/alliance","1-800-222-4335","1-866-415-9800","energy.expert@pacificpower.net","(541) 376-8446","V 01/01/14","V 01/01/14","2014-01-01",0.1,70,"wa.hvacr@pacificpower.net","wa.motors@pacificpower.net","wa.foodservice@pacificpower.net",null,"wa.bldgenvelope@pacificpower.net","wa.lighting@pacificpower.net","wa.compair@pacificpower.net","wa.farmdairy@pacificpower.net","wa.othertech@pacificpower.net","wa.finanswerexpress@pacificpower.net","24, 33, 36, 40, 47T, 48T, 53, 54","6312 SW Capitol Way #1023",null,"Portland","OR",97239,"California and Washington","Rocky Mountain Power","California","Washington",null,"CA","WA",null,"A-25, A-32, A-33, A-36, AT-47, AT-48, AWH-31, LS-53, LS-58, OL-42, PA-20, PA-40","24, 33, 36, 40, 47T, 48T, 54",null,"Bob Greeley",null,"541.601.8088","ca.lighting@pacificpower.net","Lori Sanders","509.727.0394","- Yakima","wa.lighting@pacificpower.net","William Gatchel","541.377.7943","- Walla Walla","wa.lighting@pacificpower.net",60,null,null,null,null,null,null,null,"Post-purchase Application","Post-purchase Application","Post-purchase Application","Pre-purchase Agreement","Pre-purchase Agreement","Post-purchase Application","Post-purchase Application","Pre-purchase Agreement",null,null,null,null,"www.homeenergysavings.net","www.pacificpower.net/bus/se/epi/california/ilc/ef.html","www.pacificpower.net/bus/se/epi/washington/ilc/ef.html",null,"www.pacificpower.net/bus/bst/index.html","@pacificpower.net","Washington State Energy Code 2012","2013-07-01","WSEC 2012",140,"1-503-482-7447","1-503-482-7447","wattsmart Business"]
[]
[]
[]
[]
[]
["Business Type List",null,"Install States",null,"Rate Schedules","Rate Schedules(truncated)",null,"Incentive Recipient List"]
["Agriculture - Dairy",null,"ID",null,{"$f":"IF(Rates!D10=\"\",\"\",Rates!D10)","v":"WY 212"},{"$f":"RIGHT(E13,LEN(E13)-3)","v":"212"}]
["Agriculture - Livestock",null,"UT",null,{"$f":"IF(Rates!D11=\"\",\"\",Rates!D11)","v":"WY 210"},{"$f":"RIGHT(E14,LEN(E14)-3)","v":"210"},null,"Project Address"]
["Agriculture - Poultry",null,"WY",null,{"$f":"IF(Rates!D12=\"\",\"\",Rates!D12)","v":"WY 58"},"58",null,"Participant Business Address"]
["Agriculture - Sod",null,null,null,{"$f":"IF(Rates!D13=\"\",\"\",Rates!D13)","v":"WY 54"},"54",null,"Other 3rd Party (enter below)"]
["Apartment",null,null,null,{"$f":"IF(Rates!D14=\"\",\"\",Rates!D14)","v":"WY 48T"},"48T"]
["Auditorium",null,null,null,{"$f":"IF(Rates!D15=\"\",\"\",Rates!D15)","v":"WY 46"},"46"]
["Auto Repair",null,null,null,{"$f":"IF(Rates!D16=\"\",\"\",Rates!D16)","v":"WY 40"},"40"]
["Automotive facility",null,null,null,{"$f":"IF(Rates!D17=\"\",\"\",Rates!D17)","v":"WY 33"},"33"]
["Common areas, corridors, restrooms, elevators, lobbies",null,null,null,{"$f":"IF(Rates!D18=\"\",\"\",Rates!D18)","v":"WY 28"},"28"]
["Condominium",null,null,null,{"$f":"IF(Rates!D19=\"\",\"\",Rates!D19)","v":"WY 25"},"25"]
["Convenience store",null,null,null,{"$f":"IF(Rates!D20=\"\",\"\",Rates!D20)","v":"WA 48T"},"48T"]
["Convention Center",null,null,null,{"$f":"IF(Rates!D21=\"\",\"\",Rates!D21)","v":"WA 40"},"40"]
["Courthouse",null,null,null,{"$f":"IF(Rates!D22=\"\",\"\",Rates!D22)","v":"WA 36"},"36"]
["Data Center",null,null,null,{"$f":"IF(Rates!D23=\"\",\"\",Rates!D23)","v":"WA 24"},"24"]
["Dining - Bar Lounge / Leisure",null,null,null,{"$f":"IF(Rates!D24=\"\",\"\",Rates!D24)","v":"UT 23"},"23"]
["Dining - Cafeteria / Fast Food",null,null,null,{"$f":"IF(Rates!D25=\"\",\"\",Rates!D25)","v":"UT 10"},"10"]
["Dining - Restaurant",null,null,null,{"$f":"IF(Rates!D26=\"\",\"\",Rates!D26)","v":"UT 9"},"9"]
["Dormitory",null,null,null,{"$f":"IF(Rates!D27=\"\",\"\",Rates!D27)","v":"UT 9A"},"9A"]
["Duplex",null,null,null,{"$f":"IF(Rates!D28=\"\",\"\",Rates!D28)","v":"UT 8"},"8"]
["Exercise Center/Gymnasium",null,null,null,{"$f":"IF(Rates!D29=\"\",\"\",Rates!D29)","v":"UT 6"},"6"]
["Financial Institution",null,null,null,{"$f":"IF(Rates!D30=\"\",\"\",Rates!D30)","v":"ID 35"},"35"]
["General commercial/industrial work buildings",null,null,null,{"$f":"IF(Rates!D31=\"\",\"\",Rates!D31)","v":"ID 23"},"23"]
["Grocery Stores",null,null,null,{"$f":"IF(Rates!D32=\"\",\"\",Rates!D32)","v":"ID 10"},"10"]
["Healthcare - Hospital",null,null,null,{"$f":"IF(Rates!D33=\"\",\"\",Rates!D33)","v":"ID 9"},"9"]
["Healthcare - Medical buildings and clinics",null,null,null,{"$f":"IF(Rates!D34=\"\",\"\",Rates!D34)","v":"ID 6"},"6"]
["Healthcare - Nursing homes",null,null,null,{"$f":"IF(Rates!D35=\"\",\"\",Rates!D35)","v":"ID 6A"},"6A"]
["Healthcare - other",null,null,null,{"$f":"IF(Rates!D36=\"\",\"\",Rates!D36)","v":"CA 48"},"48"]
["Hotel banquet/conference/exhibition hall",null,null,null,{"$f":"IF(Rates!D37=\"\",\"\",Rates!D37)","v":"CA 36"},"36"]
["Hotel/motel",null,null,null,{"$f":"IF(Rates!D38=\"\",\"\",Rates!D38)","v":"CA 32"},"32"]
["Industrial",null,null,null,{"$f":"Rates!D40","v":"CA PA20"}]
["Irrigation"]
["Laboratory spaces"]
["Laboratory/Scientific"]
["Laundries"]
["Library"]
["Mall"]
["Manufactured Home"]
["Manufacturing Facility"]
["Mixed use"]
["Mobile Home"]
["Multi-Family"]
["Museum/exhibit"]
["Office building, office/administrative areas"]
["Other"]
["Parking Garage"]
["Penitentiary"]
["Police/Fire Station"]
["Post Office"]
["Recreation"]
["Religious Building"]
["Retail/wholesale store"]
["School"]
["School - University"]
["School preK-12 - buildings/classrooms/daycare centers"]
["Service"]
["Single Dwelling"]
["Sports Arena"]
["Theater - motion picture"]
["Theater - performing arts"]
["Town Hall"]
["Transportation"]
["Tree fruit storage"]
["Warehouse - storage areas"]

{"sheet":"Weather Data","index":5,"n_rows":590,"n_cols":20,"rows_kept":590,"cut":false,"hidden":true,"merged":[]}
[null,"Complete List",null,null,null,null,null,null,null,{"$f":"'Chiller Calculator'!C7","v":0},"Selected Service Territory",null,null,null,null,null,null,"State","# of Weather Locations"]
[null,"State","Ref","State-Ref","City","Weather COOP Site Name","ID","CDD (65°F)",null,null,"State","Ref","State-Ref","City","Weather COOP Site Name","ID","CDD (65°F)",null,"California",{"$f":"COUNTIF($B$3:$B$461,\"CA\")","v":64}]
[null,"CA",1,{"$f":"CONCATENATE(B3,\"-\",C3)","v":"CA-1"},"Adin Ranger Stn","Adin Ranger Stn",40029,246,null,null,{"$f":"IF(L3<>\"\",$J$1,\"\")","v":0},1,{"$f":"IF(ISERROR(VLOOKUP(CONCATENATE(K3,\"-\",L3),DegreeDays,1,FALSE)),\"\",VLOOKUP(CONCATENATE(K3,\"-\",L3),DegreeDays,1,FALSE))","v":""},{"$f":"IF(M3<>\"\",VLOOKUP(M3,DegreeDays,3,FALSE),\"\")","v":""},{"$f":"N3","v":""},{"$f":"IF(M3<>\"\",VLOOKUP(M3,DegreeDays,2,FALSE),\"\")","v":""},{"$f":"IF(M3<>\"\",VLOOKUP(M3,DegreeDays,12,FALSE),\"\")","v":""},null,"Idaho",{"$f":"COUNTIF($B$3:$B$461,\"ID\")","v":84}]
[null,"CA",2,{"$f":"CONCATENATE(B4,\"-\",C4)","v":"CA-2"},"Adlerpoint","Adlerpoint",40088,630,null,null,{"$f":"IF(L4<>\"\",$J$1,\"\")","v":0},2,"","",{"$f":"N4","v":""},"","",null,"Utah",{"$f":"COUNTIF($B$3:$B$461,\"UT\")","v":246}]
[null,"CA",3,"CA-3","Alturas Ranger Station","Alturas Ranger Station",40161,175,null,null,0,3,"","","","","",null,"Washington",{"$f":"COUNTIF($B$3:$B$461,\"WA\")","v":65}]
[null,"CA",4,"CA-4","Big Bar Ranger Station","Big Bar Ranger Station",40738,932,null,null,0,4,"","","","","",null,"Wyoming",{"$f":"COUNTIF($B$3:$B$590,\"WY\")","v":129}]
[null,"CA",5,"CA-5","Burney","Burney",41214,181,null,null,0,5,"","","","",""]
[null,"CA",6,"CA-6","Callahan","Callahan",41316,323,null,null,0,6,"","","","",""]
[null,"CA",7,"CA-7","Canby Ranger Station","Canby Ranger Station",41476,212,null,null,0,7,"","","","",""]
[null,"CA",8,"CA-8","Canyon Dam","Canyon Dam",41497,177,null,null,0,8,"","","","",""]
[null,"CA",9,"CA-9","Cecilville 1 SE","Cecilville 1 SE",41606,485,null,null,0,9,"","","","",""]
[null,"CA",10,"CA-10","Cedarville","Cedarville",41614,484,null,null,0,10,"","","","",""]
[null,"CA",11,"CA-11","Chester","Chester",41700,123,null,null,0,11,"","","","",""]
[null,"CA",12,"CA-12","China Flat","China Flat",41731,621,null,null,0,12,"","","","",""]
[null,"CA",13,"CA-13","Crescent City 1 N","Crescent City 1 N",42147,8,null,null,0,13,"","","","",""]
[null,"CA",14,"CA-14","Dunsmuir Treatment Plant","Dunsmuir Treatment Plant",42574,590,null,null,0,14,"","","","",""]
[null,"CA",15,"CA-15","Elk Valley","Elk Valley",42749,201,null,null,0,15,"","","","",""]
[null,"CA",16,"CA-16","Eureka WSO City","Eureka WSO City",42910,2,null,null,0,16,"","","","",""]
[null,"CA",17,"CA-17","Fall River Mills Intake","Fall River Mills Intake",42964,276,null,null,0,17,"","","","",""]
[null,"CA",18,"CA-18","Ferndale 2 NW","Ferndale 2 NW",43030,3,null,null,0,18,"","","","",""]
[null,"CA",19,"CA-19","Fleming Fish & Game","Fleming Fish & Game",43087,337,null,null,0,19,"","","","",""]
[null,"CA",20,"CA-20","Forest Glen","Forest Glen",43130,379,null,null,0,20,"","","","",""]
[null,"CA",21,"CA-21","Fort Bidwell","Fort Bidwell",43157,243,null,null,0,21,"","","","",""]
[null,"CA",22,"CA-22","Fort Jones Ranger Stn","Fort Jones Ranger Stn",43182,374,null,null,0,22,"","","","",""]
[null,"CA",23,"CA-23","Grizzly Creek State Park","Grizzly Creek State Park",43647,37,null,null,0,23,"","","","",""]
[null,"CA",24,"CA-24","Happy Camp Ranger Stn","Happy Camp Ranger Stn",43761,735,null,null,0,24,"","","","",""]
[null,"CA",25,"CA-25","Hat Creek PH 1","Hat Creek PH 1",43824,333,null,null,0,25,"","","","",""]
[null,"CA",26,"CA-26","Hayfork Ranger Station","Hayfork Ranger Station",43859,391,null,null,0,26,"","","","",""]
[null,"CA",27,"CA-27","Hilts Slash Disposal","Hilts Slash Disposal",43987,394,null,null,0,27,"","","","",""]
[null,"CA",28,"CA-28","Hoopa","Hoopa",44082,683,null,null,0,28,"","","","",""]
[null,"CA",29,"CA-29","Jess Valley","Jess Valley",44374,132,null,null,0,29,"","","","",""]
[null,"CA",30,"CA-30","Klamath","Klamath",44577,9,null,null,0,30,"","","","",""]
[null,"CA",31,"CA-31","Lake City","Lake City",44675,404,null,null,0,31,"","","","",""]
[null,"CA",32,"CA-32","Lakeshore 2","Lakeshore 2",44709,1179,null,null,0,32,"","","","",""]
[null,"CA",33,"CA-33","Lava Beds Nat Monument","Lava Beds Nat Monument",44838,338,null,null,0,33,"","","","",""]
[null,"CA",34,"CA-34","Manzanita Lake","Manzanita Lake",45311,75,null,null,0,34,"","","","",""]
[null,"CA",35,"CA-35","Mc Cloud","Mc Cloud",45449,303,null,null,0,35,"","","","",""]
[null,"CA",36,"CA-36","Mineral","Mineral",45679,64,null,null,0,36,"","","","",""]
[null,"CA",37,"CA-37","Mount Hebron Rng Stn","Mount Hebron Rng Stn",45941,88,null,null,0,37,"","","","",""]
[null,"CA",38,"CA-38","Mount Shasta","Mount Shasta",45983,273,null,null,0,38,"","","","",""]
[null,"CA",39,"CA-39","Orick Prairie Creek Pk","Orick Prairie Creek Pk",46498,9,null,null,0,39,"","","","",""]
[null,"CA",40,"CA-40","Orleans","Orleans",46508,793,null,null,0,40,"","","","",""]
[null,"CA",41,"CA-41","Platina","Platina",46975,813,null,null,0,41,"","","","",""]
[null,"CA",42,"CA-42","Red Bluff FSS","Red Bluff FSS",47292,1850,null,null,0,42,"","","","",""]
[null,"CA",43,"CA-43","Redding","Redding",47296,2076,null,null,0,43,"","","","",""]
[null,"CA",44,"CA-44","Redding Fire Stn 4","Redding Fire Stn 4",47300,1552,null,null,0,44,"","","","",""]
[null,"CA",45,"CA-45","Redding WSO","Redding WSO",47304,1850,null,null,0,45,"","","","",""]
[null,"CA",46,"CA-46","Richardson Grove St Pk","Richardson Grove St Pk",47404,484,null,null,0,46,"","","","",""]
[null,"CA",47,"CA-47","Salyer Ranger Stn","Salyer Ranger Stn",47698,778,null,null,0,47,"","","","",""]
[null,"CA",48,"CA-48","Sawyers Bar Rngr Stn","Sawyers Bar Rngr Stn",48025,635,null,null,0,48,"","","","",""]
[null,"CA",49,"CA-49","Scotia","Scotia",48045,34,null,null,0,49,"","","","",""]
[null,"CA",50,"CA-50","Shasta Dam","Shasta Dam",48135,1832,null,null,0,50,"","","","",""]
[null,"CA",51,"CA-51","Shelter Cove","Shelter Cove",48162,45,null,null,0,51,"","","","",""]
[null,"CA",52,"CA-52","Shelter Cove Aviation","Shelter Cove Aviation",48463,122,null,null,0,52,"","","","",""]
[null,"CA",53,"CA-53","Susanville Airport","Susanville Airport",48702,389,null,null,0,53,"","","","",""]
[null,"CA",54,"CA-54","Termo 1 E","Termo 1 E",48873,105,null,null,0,54,"","","","",""]
[null,"CA",55,"CA-55","Trinity Dam Vista Point","Trinity Dam Vista Point",49024,633,null,null,0,55,"","","","",""]
[null,"CA",56,"CA-56","Trinity River Hatchery","Trinity River Hatchery",49026,659,null,null,0,56,"","","","",""]
[null,"CA",57,"CA-57","Tulelake","Tulelake",49053,139,null,null,0,57,"","","","",""]
[null,"CA",58,"CA-58","Turntable Creek","Turntable Creek",49083,1627,null,null,0,58,"","","","",""]
[null,"CA",59,"CA-59","Volta Power House","Volta Power House",49390,1272,null,null,0,59,"","","","",""]
[null,"CA",60,"CA-60","Weaverville Ranger Stn","Weaverville Ranger Stn",49490,592,null,null,0,60,"","","","",""]
[null,"CA",61,"CA-61","Weed Fire Dept","Weed Fire Dept",49499,244,null,null,0,61,"","","","",""]
[null,"CA",62,"CA-62","Whiskeytown Reservoir","Whiskeytown Reservoir",49621,1599,null,null,0,62,"","","","",""]
[null,"CA",63,"CA-63","Willow Creek 1 NW","Willow Creek 1 NW",49694,826,null,null,0,63,"","","","",""]
[null,"CA",64,"CA-64","Yreka","Yreka",49866,575,null,null,0,64,"","","","",""]
[null,"ID",1,"ID-1","Aberdeen Experiment Stn","Aberdeen Experiment Stn",100010,285,null,null,0,65,{"$f":"IF(ISERROR(VLOOKUP(CONCATENATE(K67,\"-\",L67),DegreeDays,1,FALSE)),\"\",VLOOKUP(CONCATENATE(K67,\"-\",L67),DegreeDays,1,FALSE))","v":""},{"$f":"IF(M67<>\"\",VLOOKUP(M67,DegreeDays,3,FALSE),\"\")","v":""},"",{"$f":"IF(M67<>\"\",VLOOKUP(M67,DegreeDays,2,FALSE),\"\")","v":""},{"$f":"IF(M67<>\"\",VLOOKUP(M67,DegreeDays,12,FALSE),\"\")","v":""}]
[null,"ID",2,{"$f":"CONCATENATE(B68,\"-\",C68)","v":"ID-2"},"American Falls 1 SW","American Falls 1 SW",100227,449,null,null,{"$f":"IF(L68<>\"\",$J$1,\"\")","v":0},66,"","",{"$f":"N68","v":""},"",""]
[null,"ID",3,"ID-3","Arbon 2 NW","Arbon 2 NW",100347,262,null,null,0,67,"","","","",""]
[null,"ID",4,"ID-4","Arco 3 SW","Arco 3 SW",100375,218,null,null,0,68,"","","","",""]
[null,"ID",5,"ID-5","Ashton","Ashton",100470,94,null,null,0,69,"","","","",""]
[null,"ID",6,"ID-6","Bern","Bern",100803,112,null,null,0,70,"","","","",""]
[null,"ID",7,"ID-7","Blackfoot 2 SSW","Blackfoot 2 SSW",100915,366,null,null,0,71,"","","","",""]
[null,"ID",8,"ID-8","Burley","Burley",101288,690,null,null,0,72,"","","","",""]
[null,"ID",9,"ID-9","Burley FAA Airport","Burley FAA Airport",101303,442,null,null,0,73,"","","","",""]
[null,"ID",10,"ID-10","Burley Factory","Burley Factory",101298,398,null,null,0,74,"","","","",""]
[null,"ID",11,"ID-11","Challis","Challis",101663,273,null,null,0,75,"","","","",""]
[null,"ID",12,"ID-12","Chilly Barton Flat","Chilly Barton Flat",101671,52,null,null,0,76,"","","","",""]
[null,"ID",13,"ID-13","Cobalt","Cobalt",101932,61,null,null,0,77,"","","","",""]
[null,"ID",14,"ID-14","Cobalt Blackbird Mine","Cobalt Blackbird Mine",101938,10,null,null,0,78,"","","","",""]
[null,"ID",15,"ID-15","Conda","Conda",102071,89,null,null,0,79,"","","","",""]
[null,"ID",16,"ID-16","Craters of the Moon NM","Craters of the Moon NM",102260,295,null,null,0,80,"","","","",""]
[null,"ID",17,"ID-17","Driggs","Driggs",102676,74,null,null,0,81,"","","","",""]
[null,"ID",18,"ID-18","Dubois Experiment Stn","Dubois Experiment Stn",102707,304,null,null,0,82,"","","","",""]
[null,"ID",19,"ID-19","Dubois FAA Airport","Dubois FAA Airport",102717,325,null,null,0,83,"","","","",""]
[null,"ID",20,"ID-20","Fort Hall Indian Agency","Fort Hall Indian Agency",103297,336,null,null,0,84,"","","","",""]
[null,"ID",21,"ID-21","Galena","Galena",103417,1,null,null,0,85,"","","","",""]
[null,"ID",22,"ID-22","Gibbonsville","Gibbonsville",103554,129,null,null,0,86,"","","","",""]
[null,"ID",23,"ID-23","Grace","Grace",103732,165,null,null,0,87,"","","","",""]
[null,"ID",24,"ID-24","Gray","Gray",103825,73,null,null,0,88,"","","","",""]
[null,"ID",25,"ID-25","Grouse","Grouse",103882,15,null,null,0,89,"","","","",""]
[null,"ID",26,"ID-26","Hailey 3 NNW","Hailey 3 NNW",103942,214,null,null,0,90,"","","","",""]
[null,"ID",27,"ID-27","Hazelton","Hazelton",104140,510,null,null,0,91,"","","","",""]
[null,"ID",28,"ID-28","Henry","Henry",104230,41,null,null,0,92,"","","","",""]
[null,"ID",29,"ID-29","Hollister","Hollister",104295,435,null,null,0,93,"","","","",""]
[null,"ID",30,"ID-30","Howe","Howe",104384,289,null,null,0,94,"","","","",""]
[null,"ID",31,"ID-31","Idaho Falls 16 SE","Idaho Falls 16 SE",104456,79,null,null,0,95,"","","","",""]
[null,"ID",32,"ID-32","Idaho Falls 2 ESE","Idaho Falls 2 ESE",104455,354,null,null,0,96,"","","","",""]
[null,"ID",33,"ID-33","Idaho Falls 43 NW WB","Idaho Falls 43 NW WB",104459,271,null,null,0,97,"","","","",""]
[null,"ID",34,"ID-34","Idaho Falls 46 W","Idaho Falls 46 W",104460,273,null,null,0,98,"","","","",""]
[null,"ID",35,"ID-35","Idaho Falls FAA Airport","Idaho Falls FAA Airport",104457,269,null,null,0,99,"","","","",""]
[null,"ID",36,"ID-36","Irwin 2 SE","Irwin 2 SE",104588,147,null,null,0,100,"","","","",""]
[null,"ID",37,"ID-37","Island Park","Island Park",104598,25,null,null,0,101,"","","","",""]
[null,"ID",38,"ID-38","Jerome","Jerome",104670,665,null,null,0,102,"","","","",""]
[null,"ID",39,"ID-39","Ketchum Ranger Stn","Ketchum Ranger Stn",104845,44,null,null,0,103,"","","","",""]
[null,"ID",40,"ID-40","Kilgore","Kilgore",104908,5,null,null,0,104,"","","","",""]
[null,"ID",41,"ID-41","Leadore 2","Leadore 2",105177,53,null,null,0,105,"","","","",""]
[null,"ID",42,"ID-42","Lifton Pumping Stn","Lifton Pumping Stn",105275,138,null,null,0,106,"","","","",""]
[null,"ID",43,"ID-43","Mackay 4 NW","Mackay 4 NW",105466,142,null,null,0,107,"","","","",""]
[null,"ID",44,"ID-44","Mackay Ranger Stn","Mackay Ranger Stn",105462,164,null,null,0,108,"","","","",""]
[null,"ID",45,"ID-45","Magic Lake Resort","Magic Lake Resort",105510,450,null,null,0,109,"","","","",""]
[null,"ID",46,"ID-46","Malad ","Malad ",105544,400,null,null,0,110,"","","","",""]
[null,"ID",47,"ID-47","Malad City","Malad City",105559,334,null,null,0,111,"","","","",""]
[null,"ID",48,"ID-48","Malta 2 E","Malta 2 E",105563,351,null,null,0,112,"","","","",""]
[null,"ID",49,"ID-49","Malta Aviation","Malta Aviation",105567,382,null,null,0,113,"","","","",""]
[null,"ID",50,"ID-50","Massacre Rocks ST PK","Massacre Rocks ST PK",105678,592,null,null,0,114,"","","","",""]
[null,"ID",51,"ID-51","May","May",105685,146,null,null,0,115,"","","","",""]
[null,"ID",52,"ID-52","Mccammon","Mccammon",105716,315,null,null,0,116,"","","","",""]
[null,"ID",53,"ID-53","Minidoka 10 WNW","Minidoka 10 WNW",105972,264,null,null,0,117,"","","","",""]
[null,"ID",54,"ID-54","Minidoka Dam","Minidoka Dam",105980,531,null,null,0,118,"","","","",""]
[null,"ID",55,"ID-55","Montpelier Ranger Stn","Montpelier Ranger Stn",106053,151,null,null,0,119,"","","","",""]
[null,"ID",56,"ID-56","Oakley","Oakley",106542,443,null,null,0,120,"","","","",""]
[null,"ID",57,"ID-57","Palisades","Palisades",106764,212,null,null,0,121,"","","","",""]
[null,"ID",58,"ID-58","Paul 1 ENE","Paul 1 ENE",106877,423,null,null,0,122,"","","","",""]
[null,"ID",59,"ID-59","Picabo","Picabo",107040,214,null,null,0,123,"","","","",""]
[null,"ID",60,"ID-60","Pocatello 2","Pocatello 2",107208,597,null,null,0,124,"","","","",""]
[null,"ID",61,"ID-61","Pocatello WSO Airport","Pocatello WSO Airport",107211,429,null,null,0,125,"","","","",""]
[null,"ID",62,"ID-62","Preston","Preston",107346,353,null,null,0,126,"","","","",""]
[null,"ID",63,"ID-63","Preston Sugar Factory 2","Preston Sugar Factory 2",104353,356,null,null,0,127,"","","","",""]
[null,"ID",64,"ID-64","Rexburg Ricks College","Rexburg Ricks College",107644,205,null,null,0,128,"","","","",""]
[null,"ID",65,"ID-65","Richfield","Richfield",107673,381,null,null,0,129,{"$f":"IF(ISERROR(VLOOKUP(CONCATENATE(K131,\"-\",L131),DegreeDays,1,FALSE)),\"\",VLOOKUP(CONCATENATE(K131,\"-\",L131),DegreeDays,1,FALSE))","v":""},{"$f":"IF(M131<>\"\",VLOOKUP(M131,DegreeDays,3,FALSE),\"\")","v":""},"",{"$f":"IF(M131<>\"\",VLOOKUP(M131,DegreeDays,2,FALSE),\"\")","v":""},{"$f":"IF(M131<>\"\",VLOOKUP(M131,DegreeDays,12,FALSE),\"\")","v":""}]
[null,"ID",66,{"$f":"CONCATENATE(B132,\"-\",C132)","v":"ID-66"},"Rupert 3 WSW","Rupert 3 WSW",107968,452,null,null,{"$f":"IF(L132<>\"\",$J$1,\"\")","v":0},130,"","",{"$f":"N132","v":""},"",""]
[null,"ID",67,"ID-67","Salmon Airport","Salmon Airport",108076,228,null,null,{"$f":"IF(L133<>\"\",$J$1,\"\")","v":0},131,"","","","",""]
[null,"ID",68,"ID-68","Salmon KSRA","Salmon KSRA",108080,352,null,null,0,132,"","","","",""]
[null,"ID",69,"ID-69","Shoshone 1 WNW","Shoshone 1 WNW",108380,675,null,null,0,133,"","","","",""]
[null,"ID",70,"ID-70","Shoup","Shoup",108395,433,null,null,0,134,"","","","",""]
[null,"ID",71,"ID-71","Soda Springs Airport","Soda Springs Airport",108535,116,null,null,0,135,"","","","",""]
[null,"ID",72,"ID-72","Spencer Ranger Stn","Spencer Ranger Stn",108604,45,null,null,0,136,"","","","",""]
[null,"ID",73,"ID-73","Springfield","Springfield",108626,269,null,null,0,137,"","","","",""]
[null,"ID",74,"ID-74","St Anthony 1 WNW","St Anthony 1 WNW",108022,120,null,null,0,138,"","","","",""]
[null,"ID",75,"ID-75","Strevell","Strevell",108786,370,null,null,0,139,"","","","",""]
[null,"ID",76,"ID-76","Sugar","Sugar",108818,126,null,null,0,140,"","","","",""]
[null,"ID",77,"ID-77","Sun Valley","Sun Valley",108906,26,null,null,0,141,"","","","",""]
[null,"ID",78,"ID-78","Swan Valley 2 E","Swan Valley 2 E",108937,116,null,null,0,142,"","","","",""]
[null,"ID",79,"ID-79","Tetonia Experiment Stn","Tetonia Experiment Stn",109065,55,null,null,0,143,"","","","",""]
[null,"ID",80,"ID-80","Twin Falls 2 NNE","Twin Falls 2 NNE",109294,499,null,null,0,144,"","","","",""]
[null,"ID",81,"ID-81","Twin Falls 3 SE","Twin Falls 3 SE",109299,513,null,null,0,145,"","","","",""]
[null,"ID",82,"ID-82","Twin Falls Kmvt","Twin Falls Kmvt",109293,604,null,null,0,146,"","","","",""]
[null,"ID",83,"ID-83","Twin Falls WSO","Twin Falls WSO",109303,372,null,null,0,147,"","","","",""]
[null,"ID",84,"ID-84","Wayan 1 N","Wayan 1 N",109601,42,null,null,0,148,"","","","",""]
[null,"UT",1,"UT-1","Allen's Ranch","Allen's Ranch",420050,389,null,null,0,149,"","","","",""]
[null,"UT",2,"UT-2","Alpine","Alpine",420061,637,null,null,0,150,"","","","",""]
[null,"UT",3,"UT-3","Alta","Alta",420072,17,null,null,0,151,"","","","",""]
[null,"UT",4,"UT-4","Altamont","Altamont",420074,220,null,null,0,152,"","","","",""]
[null,"UT",5,"UT-5","Alton","Alton",420086,133,null,null,0,153,"","","","",""]
[null,"UT",6,"UT-6","Aneth Plant","Aneth Plant",420157,1391,null,null,0,154,"","","","",""]
[null,"UT",7,"UT-7","Angle","Angle",420168,127,null,null,0,155,"","","","",""]
[null,"UT",8,"UT-8","Antelope Island","Antelope Island",420194,1063,null,null,0,156,"","","","",""]
[null,"UT",9,"UT-9","Antimony","Antimony",420201,136,null,null,0,157,"","","","",""]
[null,"UT",10,"UT-10","Arches Natl Park HQ","Arches Natl Park HQ",420336,1782,null,null,0,158,"","","","",""]
[null,"UT",11,"UT-11","ASR Research Lab","ASR Research Lab",420302,650,null,null,0,159,"","","","",""]
[null,"UT",12,"UT-12","ASTR Research Lab","ASTR Research Lab",427608,919,null,null,0,160,"","","","",""]
[null,"UT",13,"UT-13","Bauer","Bauer",420478,751,null,null,0,161,"","","","",""]
[null,"UT",14,"UT-14","Bear Lake State Park","Bear Lake State Park",420487,235,null,null,0,162,"","","","",""]
[null,"UT",15,"UT-15","Bear River Bay","Bear River Bay",420490,1041,null,null,0,163,"","","","",""]
[null,"UT",16,"UT-16","Bear River Refuge","Bear River Refuge",420506,824,null,null,0,164,"","","","",""]
[null,"UT",17,"UT-17","Beaver","Beaver",420519,290,null,null,0,165,"","","","",""]
[null,"UT",18,"UT-18","Beaver Canyon PH","Beaver Canyon PH",420527,200,null,null,0,166,"","","","",""]
[null,"UT",19,"UT-19","Big Water","Big Water",420688,1787,null,null,0,167,"","","","",""]
[null,"UT",20,"UT-20","Bingham Canyon","Bingham Canyon",420699,532,null,null,0,168,"","","","",""]
[null,"UT",21,"UT-21","Bingham Canyon 2 NE","Bingham Canyon 2 NE",420700,775,null,null,0,169,"","","","",""]
[null,"UT",22,"UT-22","Birdseye","Birdseye",420716,110,null,null,0,170,"","","","",""]
[null,"UT",23,"UT-23","Black Rock","Black Rock",420730,588,null,null,0,171,"","","","",""]
[null,"UT",24,"UT-24","Blanding","Blanding",420738,632,null,null,0,172,"","","","",""]
[null,"UT",25,"UT-25","Blowhard Mtn Radar","Blowhard Mtn Radar",420757,4,null,null,0,173,"","","","",""]
[null,"UT",26,"UT-26","Bluff","Bluff",420788,1231,null,null,0,174,"","","","",""]
[null,"UT",27,"UT-27","Bonanza","Bonanza",420802,746,null,null,0,175,"","","","",""]
[null,"UT",28,"UT-28","Bonanza Pumping Stn","Bonanza Pumping Stn",420810,818,null,null,0,176,"","","","",""]
[null,"UT",29,"UT-29","Boulder","Boulder",420849,482,null,null,0,177,"","","","",""]
[null,"UT",30,"UT-30","Bountiful-Val Verda","Bountiful-Val Verda",420820,966,null,null,0,178,"","","","",""]
[null,"UT",31,"UT-31","Brian Head","Brian Head",420900,0,null,null,0,179,"","","","",""]
[null,"UT",32,"UT-32","Brigham City","Brigham City",420924,968,null,null,0,180,"","","","",""]
[null,"UT",33,"UT-33","Brigham City Waste Plt","Brigham City Waste Plt",420928,675,null,null,0,181,"","","","",""]
[null,"UT",34,"UT-34","Bryce Canyon FAA Airport","Bryce Canyon FAA Airport",421002,17,null,null,0,182,"","","","",""]
[null,"UT",35,"UT-35","Bryce Canyon Natl Pk HQ","Bryce Canyon Natl Pk HQ",421008,42,null,null,0,183,"","","","",""]
[null,"UT",36,"UT-36","Bryce Canyon Nat'l Prk","Bryce Canyon Nat'l Prk",421006,9,null,null,0,184,"","","","",""]
[null,"UT",37,"UT-37","Bryce Canyon Nat'l Prk","Bryce Canyon Nat'l Prk",421007,34,null,null,0,185,"","","","",""]
[null,"UT",38,"UT-38","Bullfrog Basin","Bullfrog Basin",421020,2030,null,null,0,186,"","","","",""]
[null,"UT",39,"UT-39","Callao","Callao",421144,692,null,null,0,187,"","","","",""]
[null,"UT",40,"UT-40","Callister Ranch","Callister Ranch",421149,836,null,null,0,188,"","","","",""]
[null,"UT",41,"UT-41","Canyonlands The Neck","Canyonlands The Neck",421163,1158,null,null,0,189,"","","","",""]
[null,"UT",42,"UT-42","Canyonlands The Needle","Canyonlands The Needle",421168,1189,null,null,0,190,"","","","",""]
[null,"UT",43,"UT-43","Capitol Reef Natl Park","Capitol Reef Natl Park",421171,1144,null,null,0,191,"","","","",""]
[null,"UT",44,"UT-44","Castle Dale","Castle Dale",421214,430,null,null,0,192,"","","","",""]
[null,"UT",45,"UT-45","Castle Valley Inst","Castle Valley Inst",421241,1262,null,null,0,193,{"$f":"IF(ISERROR(VLOOKUP(CONCATENATE(K195,\"-\",L195),DegreeDays,1,FALSE)),\"\",VLOOKUP(CONCATENATE(K195,\"-\",L195),DegreeDays,1,FALSE))","v":""},{"$f":"IF(M195<>\"\",VLOOKUP(M195,DegreeDays,3,FALSE),\"\")","v":""},"",{"$f":"IF(M195<>\"\",VLOOKUP(M195,DegreeDays,2,FALSE),\"\")","v":""},{"$f":"IF(M195<>\"\",VLOOKUP(M195,DegreeDays,12,FALSE),\"\")","v":""}]
[null,"UT",46,{"$f":"CONCATENATE(B196,\"-\",C196)","v":"UT-46"},"Castleton","Castleton",421230,823,null,null,{"$f":"IF(L196<>\"\",$J$1,\"\")","v":0},194,"","",{"$f":"N196","v":""},"",""]
[null,"UT",47,"UT-47","Cedar City 5 E","Cedar City 5 E",421260,426,null,null,0,195,"","","","",""]
[null,"UT",48,"UT-48","Cedar City FAA Airport","Cedar City FAA Airport",421267,671,null,null,0,196,"","","","",""]
[null,"UT",49,"UT-49","Cedar City Powerhouse","Cedar City Powerhouse",421272,664,null,null,0,197,"","","","",""]
[null,"UT",50,"UT-50","Cedar City Steam Plant","Cedar City Steam Plant",421273,717,null,null,0,198,"","","","",""]
[null,"UT",51,"UT-51","Cedar Point","Cedar Point",421308,355,null,null,0,199,"","","","",""]
[null,"UT",52,"UT-52","Church Wells","Church Wells",421418,1417,null,null,0,200,"","","","",""]
[null,"UT",53,"UT-53","Circleville","Circleville",421432,365,null,null,0,201,"","","","",""]
[null,"UT",54,"UT-54","Cisco","Cisco",421440,1178,null,null,0,202,"","","","",""]
[null,"UT",55,"UT-55","City Creek Water Plant","City Creek Water Plant",421446,619,null,null,0,203,"","","","",""]
[null,"UT",56,"UT-56","Clear Creek","Clear Creek",421427,2,null,null,0,204,"","","","",""]
[null,"UT",57,"UT-57","Clear Lake Refuge","Clear Lake Refuge",421500,806,null,null,0,205,"","","","",""]
[null,"UT",58,"UT-58","Coalville","Coalville",421588,141,null,null,0,206,"","","","",""]
[null,"UT",59,"UT-59","Coalville 13 E","Coalville 13 E",421590,62,null,null,0,207,"","","","",""]
[null,"UT",60,"UT-60","Corinne","Corinne",421731,692,null,null,0,208,"","","","",""]
[null,"UT",61,"UT-61","Cottonwood Weir","Cottonwood Weir",421759,1253,null,null,0,209,"","","","",""]
[null,"UT",62,"UT-62","Cove Fort","Cove Fort",421792,489,null,null,0,210,"","","","",""]
[null,"UT",63,"UT-63","Currant Creek Junction","Currant Creek Junction",421907,191,null,null,0,211,"","","","",""]
[null,"UT",64,"UT-64","Cutler Dam Utah P&L Co","Cutler Dam Utah P&L Co",421918,874,null,null,0,212,"","","","",""]
[null,"UT",65,"UT-65","Deer Creek Dam","Deer Creek Dam",422057,161,null,null,0,213,"","","","",""]
[null,"UT",66,"UT-66","Delta","Delta",422090,818,null,null,0,214,"","","","",""]
[null,"UT",67,"UT-67","Deseret","Deseret",422101,669,null,null,0,215,"","","","",""]
[null,"UT",68,"UT-68","Desert Exp Range","Desert Exp Range",422116,621,null,null,0,216,"","","","",""]
[null,"UT",69,"UT-69","Dewey","Dewey",422150,1276,null,null,0,217,"","","","",""]
[null,"UT",70,"UT-70","Dinosaur National Monum","Dinosaur National Monum",422172,953,null,null,0,218,"","","","",""]
[null,"UT",71,"UT-71","Dinosaur NM Quarry Area","Dinosaur NM Quarry Area",422173,756,null,null,0,219,"","","","",""]
[null,"UT",72,"UT-72","Draper Point of the Mtn","Draper Point of the Mtn",422235,1199,null,null,0,220,"","","","",""]
[null,"UT",73,"UT-73","Duchesne","Duchesne",422253,327,null,null,0,221,"","","","",""]
[null,"UT",74,"UT-74","Duchesne Airport","Duchesne Airport",422252,479,null,null,0,222,"","","","",""]
[null,"UT",75,"UT-75","Dugway","Dugway",422257,1039,null,null,0,223,"","","","",""]
[null,"UT",76,"UT-76","Echo Dam","Echo Dam",422385,241,null,null,0,224,"","","","",""]
[null,"UT",77,"UT-77","Elberta","Elberta",422418,788,null,null,0,225,"","","","",""]
[null,"UT",78,"UT-78","Electric Lake UP&L","Electric Lake UP&L",422424,2,null,null,0,226,"","","","",""]
[null,"UT",79,"UT-79","Emery","Emery",422484,227,null,null,0,227,"","","","",""]
[null,"UT",80,"UT-80","Emery 15 SW","Emery 15 SW",422488,33,null,null,0,228,"","","","",""]
[null,"UT",81,"UT-81","Enterprise Beryl Jct","Enterprise Beryl Jct",422561,379,null,null,0,229,"","","","",""]
[null,"UT",82,"UT-82","Ephraim Sorensens FLD","Ephraim Sorensens FLD",422578,481,null,null,0,230,"","","","",""]
[null,"UT",83,"UT-83","Escalante","Escalante",422592,461,null,null,0,231,"","","","",""]
[null,"UT",84,"UT-84","Eskdale","Eskdale",422607,795,null,null,0,232,"","","","",""]
[null,"UT",85,"UT-85","Eureka","Eureka",422625,355,null,null,0,233,"","","","",""]
[null,"UT",86,"UT-86","Fairfield","Fairfield",422696,363,null,null,0,234,"","","","",""]
[null,"UT",87,"UT-87","Fairview 8 N","Fairview 8 N",422702,108,null,null,0,235,"","","","",""]
[null,"UT",88,"UT-88","Farmington","Farmington",422721,894,null,null,0,236,"","","","",""]
[null,"UT",89,"UT-89","Farmington USU Fld Stn","Farmington USU Fld Stn",422726,925,null,null,0,237,"","","","",""]
[null,"UT",90,"UT-90","Ferron","Ferron",422798,595,null,null,0,238,"","","","",""]
[null,"UT",91,"UT-91","Fillmore","Fillmore",422828,918,null,null,0,239,"","","","",""]
[null,"UT",92,"UT-92","Fish Springs Refuge","Fish Springs Refuge",422852,1264,null,null,0,240,"","","","",""]
[null,"UT",93,"UT-93","Flaming Gorge","Flaming Gorge",422864,224,null,null,0,241,"","","","",""]
[null,"UT",94,"UT-94","Fort Duchesne","Fort Duchesne",422996,439,null,null,0,242,"","","","",""]
[null,"UT",95,"UT-95","Fremont Indian SP","Fremont Indian SP",423012,455,null,null,0,243,"","","","",""]
[null,"UT",96,"UT-96","Fruita","Fruita",423046,974,null,null,0,244,"","","","",""]
[null,"UT",97,"UT-97","Garfield","Garfield",423097,1328,null,null,0,245,"","","","",""]
[null,"UT",98,"UT-98","Garland 1 NW","Garland 1 NW",423122,611,null,null,0,246,"","","","",""]
[null,"UT",99,"UT-99","Garrison","Garrison",423138,758,null,null,0,247,"","","","",""]
[null,"UT",100,"UT-100","Geneva Steel","Geneva Steel",423182,1004,null,null,0,248,"","","","",""]
[null,"UT",101,"UT-101","Geneva Steel 2","Geneva Steel 2",423183,994,null,null,0,249,"","","","",""]
[null,"UT",102,"UT-102","Glen Canyon City","Glen Canyon City",423232,1598,null,null,0,250,"","","","",""]
[null,"UT",103,"UT-103","Gold Hill","Gold Hill",423260,1026,null,null,{"$f":"IF(L253<>\"\",$J$1,\"\")","v":0},251,"","","","",""]
[null,"UT",104,"UT-104","Grantsville","Grantsville",423348,1130,null,null,0,252,"","","","",""]
[null,"UT",105,"UT-105","Green River Aviation","Green River Aviation",423418,1178,null,null,0,253,"","","","",""]
[null,"UT",106,"UT-106","Grouse Creek","Grouse Creek",423486,310,null,null,0,254,"","","","",""]
[null,"UT",107,"UT-107","Gunnison","Gunnison",423514,458,null,null,0,255,"","","","",""]
[null,"UT",108,"UT-108","Hanksville","Hanksville",423611,1313,null,null,0,256,"","","","",""]
[null,"UT",109,"UT-109","Hanna","Hanna",423624,87,null,null,0,257,{"$f":"IF(ISERROR(VLOOKUP(CONCATENATE(K259,\"-\",L259),DegreeDays,1,FALSE)),\"\",VLOOKUP(CONCATENATE(K259,\"-\",L259),DegreeDays,1,FALSE))","v":""},{"$f":"IF(M259<>\"\",VLOOKUP(M259,DegreeDays,3,FALSE),\"\")","v":""},"",{"$f":"IF(M259<>\"\",VLOOKUP(M259,DegreeDays,2,FALSE),\"\")","v":""},{"$f":"IF(M259<>\"\",VLOOKUP(M259,DegreeDays,12,FALSE),\"\")","v":""}]
[null,"UT",110,{"$f":"CONCATENATE(B260,\"-\",C260)","v":"UT-110"},"Hans Flat Ranger Stn","Hans Flat Ranger Stn",423600,919,null,null,0,258,"","",{"$f":"N260","v":""},"",""]
[null,"UT",111,"UT-111","Hardware Ranch","Hardware Ranch",423671,53,null,null,0,259,"","","","",""]
[null,"UT",112,"UT-112","Heber","Heber",423809,187,null,null,0,260,"","","","",""]
[null,"UT",113,"UT-113","Henrieville","Henrieville",423847,342,null,null,0,261,"","","","",""]
[null,"UT",114,"UT-114","Hiawatha","Hiawatha",423896,275,null,null,0,262,"","","","",""]
[null,"UT",115,"UT-115","Hite","Hite",423968,2179,null,null,0,263,"","","","",""]
[null,"UT",116,"UT-116","Hite Marina","Hite Marina",423976,2278,null,null,0,264,"","","","",""]
[null,"UT",117,"UT-117","Hite Ranger Stn","Hite Ranger Stn",423980,2289,null,null,0,265,"","","","",""]
[null,"UT",118,"UT-118","Hovenweep NM","Hovenweep NM",424100,885,null,null,0,266,"","","","",""]
[null,"UT",119,"UT-119","Huntsville Monastery","Huntsville Monastery",424135,230,null,null,0,267,"","","","",""]
[null,"UT",120,"UT-120","Ibapah","Ibapah",424174,303,null,null,0,268,"","","","",""]
[null,"UT",121,"UT-121","Iosepa South Ranch","Iosepa South Ranch",424233,669,null,null,0,269,"","","","",""]
[null,"UT",122,"UT-122","Jensen","Jensen",424342,493,null,null,0,270,"","","","",""]
[null,"UT",123,"UT-123","Johnson Pass","Johnson Pass",424362,764,null,null,0,271,"","","","",""]
[null,"UT",124,"UT-124","Kamas 3 NW","Kamas 3 NW",424467,156,null,null,0,272,"","","","",""]
[null,"UT",125,"UT-125","Kanab","Kanab",424508,872,null,null,0,273,"","","","",""]
[null,"UT",126,"UT-126","Kanosh","Kanosh",424527,1070,null,null,0,274,"","","","",""]
[null,"UT",127,"UT-127","Knolls 10 NE","Knolls 10 NE",424748,992,null,null,0,275,"","","","",""]
[null,"UT",128,"UT-128","Kodachrome Basin Park","Kodachrome Basin Park",424755,482,null,null,0,276,"","","","",""]
[null,"UT",129,"UT-129","Koosharem","Koosharem",424764,97,null,null,0,277,"","","","",""]
[null,"UT",130,"UT-130","La Sal","La Sal",424946,296,null,null,0,278,"","","","",""]
[null,"UT",131,"UT-131","La Sal 2 NE","La Sal 2 NE",424947,384,null,null,0,279,"","","","",""]
[null,"UT",132,"UT-132","La Verkin","La Verkin",424968,1730,null,null,0,280,"","","","",""]
[null,"UT",133,"UT-133","Lakeside","Lakeside",424846,1229,null,null,0,281,"","","","",""]
[null,"UT",134,"UT-134","Laketown","Laketown",424856,112,null,null,0,282,"","","","",""]
[null,"UT",135,"UT-135","Levan","Levan",425065,567,null,null,0,283,"","","","",""]
[null,"UT",136,"UT-136","Lewiston","Lewiston",425082,316,null,null,0,284,"","","","",""]
[null,"UT",137,"UT-137","Little Sahara Dunes","Little Sahara Dunes",425138,691,null,null,0,285,"","","","",""]
[null,"UT",138,"UT-138","Loa","Loa",425148,60,null,null,0,286,"","","","",""]
[null,"UT",139,"UT-139","Logan 5 SW Exp Farm","Logan 5 SW Exp Farm",425194,373,null,null,0,287,"","","","",""]
[null,"UT",140,"UT-140","Logan Radio KVNU","Logan Radio KVNU",425182,493,null,null,0,288,"","","","",""]
[null,"UT",141,"UT-141","Logan USU Exp Stn","Logan USU Exp Stn",425190,475,null,null,0,289,"","","","",""]
[null,"UT",142,"UT-142","Logan Utah State Univ","Logan Utah State Univ",425186,615,null,null,0,290,"","","","",""]
[null,"UT",143,"UT-143","Lower American Fork Pow","Lower American Fork Pow",425219,958,null,null,0,291,"","","","",""]
[null,"UT",144,"UT-144","Lucin","Lucin",425239,744,null,null,0,292,"","","","",""]
[null,"UT",145,"UT-145","Lund","Lund",425247,574,null,null,0,293,"","","","",""]
[null,"UT",146,"UT-146","Lytle Ranch","Lytle Ranch",425252,1718,null,null,0,294,"","","","",""]
[null,"UT",147,"UT-147","Maeser 9 NW","Maeser 9 NW",425268,349,null,null,0,295,"","","","",""]
[null,"UT",148,"UT-148","Magna Asarco Farm","Magna Asarco Farm",425330,872,null,null,0,296,"","","","",""]
[null,"UT",149,"UT-149","Manila","Manila",425377,282,null,null,0,297,"","","","",""]
[null,"UT",150,"UT-150","Manti ","Manti ",425402,374,null,null,0,298,"","","","",""]
[null,"UT",151,"UT-151","Marysvale","Marysvale",425477,328,null,null,0,299,"","","","",""]
[null,"UT",152,"UT-152","Mexican Hat","Mexican Hat",425582,1594,null,null,0,300,"","","","",""]
[null,"UT",153,"UT-153","Midlake","Midlake",425607,1113,null,null,0,301,"","","","",""]
[null,"UT",154,"UT-154","Midvale","Midvale",425610,881,null,null,0,302,"","","","",""]
[null,"UT",155,"UT-155","Milford","Milford",425654,645,null,null,0,303,"","","","",""]
[null,"UT",156,"UT-156","Moab","Moab",425733,1446,null,null,0,304,"","","","",""]
[null,"UT",157,"UT-157","Modena","Modena",425752,528,null,null,0,305,"","","","",""]
[null,"UT",158,"UT-158","Montezuma Creek","Montezuma Creek",425795,366,null,null,{"$f":"IF(L308<>\"\",$J$1,\"\")","v":0},306,"","","","",""]
[null,"UT",159,"UT-159","Monticello","Monticello",425805,243,null,null,0,307,"","","","",""]
[null,"UT",160,"UT-160","Monument Vyl Mission","Monument Vyl Mission",425812,1427,null,null,0,308,"","","","",""]
[null,"UT",161,"UT-161","Morgan","Morgan",425826,331,null,null,0,309,"","","","",""]
[null,"UT",162,"UT-162","Moroni","Moroni",425837,318,null,null,0,310,"","","","",""]
[null,"UT",163,"UT-163","Mountain Dell Dam","Mountain Dell Dam",425892,356,null,null,0,311,"","","","",""]
[null,"UT",164,"UT-164","Myton","Myton",425969,507,null,null,0,312,"","","","",""]
[null,"UT",165,"UT-165","Natural Bridges Natl Mo","Natural Bridges Natl Mo",426053,721,null,null,0,313,"","","","",""]
[null,"UT",166,"UT-166","Navajo Mountain","Navajo Mountain",426076,641,null,null,0,314,"","","","",""]
[null,"UT",167,"UT-167","Neola","Neola",426123,318,null,null,0,315,"","","","",""]
[null,"UT",168,"UT-168","Nephi","Nephi",426135,825,null,null,0,316,"","","","",""]
[null,"UT",169,"UT-169","New Harmony","New Harmony",426181,676,null,null,0,317,"","","","",""]
[null,"UT",170,"UT-170","Nutters Ranch","Nutters Ranch",426340,376,null,null,0,318,"","","","",""]
[null,"UT",171,"UT-171","Oak City","Oak City",426357,1131,null,null,0,319,"","","","",""]
[null,"UT",172,"UT-172","Ogden Pioneer PH","Ogden Pioneer PH",426404,895,null,null,0,320,"","","","",""]
[null,"UT",173,"UT-173","Ogden Sugar Factory","Ogden Sugar Factory",426414,859,null,null,0,321,{"$f":"IF(ISERROR(VLOOKUP(CONCATENATE(K323,\"-\",L323),DegreeDays,1,FALSE)),\"\",VLOOKUP(CONCATENATE(K323,\"-\",L323),DegreeDays,1,FALSE))","v":""},{"$f":"IF(M323<>\"\",VLOOKUP(M323,DegreeDays,3,FALSE),\"\")","v":""},"",{"$f":"IF(M323<>\"\",VLOOKUP(M323,DegreeDays,2,FALSE),\"\")","v":""},{"$f":"IF(M323<>\"\",VLOOKUP(M323,DegreeDays,12,FALSE),\"\")","v":""}]
[null,"UT",174,{"$f":"CONCATENATE(B324,\"-\",C324)","v":"UT-174"},"Olmstead Powerhouse","Olmstead Powerhouse",426455,896,null,null,0,322,"","",{"$f":"N324","v":""},"",""]
[null,"UT",175,"UT-175","Orderville","Orderville",426534,611,null,null,0,323,"","","","",""]
[null,"UT",176,"UT-176","Orem Treatment Plant","Orem Treatment Plant",426538,1051,null,null,0,324,"","","","",""]
[null,"UT",177,"UT-177","Ouray 4 NE","Ouray 4 NE",426568,786,null,null,0,325,"","","","",""]
[null,"UT",178,"UT-178","Panguitch","Panguitch",426601,94,null,null,0,326,"","","","",""]
[null,"UT",179,"UT-179","Park City Fire Station 31","Park City Fire Station 31",426644,115,null,null,0,327,"","","","",""]
[null,"UT",180,"UT-180","Park City Radio","Park City Radio",426648,154,null,null,0,328,"","","","",""]
[null,"UT",181,"UT-181","Park City Summit House","Park City Summit House",426652,18,null,null,0,329,"","","","",""]
[null,"UT",182,"UT-182","Park Valley","Park Valley",426658,450,null,null,0,330,"","","","",""]
[null,"UT",183,"UT-183","Park Valley Muddy Ranch","Park Valley Muddy Ranch",426660,474,null,null,0,331,"","","","",""]
[null,"UT",184,"UT-184","Parowan Power Plant","Parowan Power Plant",426686,460,null,null,0,332,"","","","",""]
[null,"UT",185,"UT-185","Partoun","Partoun",426708,788,null,null,0,333,"","","","",""]
[null,"UT",186,"UT-186","Pine View Dam","Pine View Dam",426869,269,null,null,0,334,"","","","",""]
[null,"UT",187,"UT-187","Piute Dam","Piute Dam",426897,467,null,null,0,335,"","","","",""]
[null,"UT",188,"UT-188","Pleasant Creek Powerhouse","Pleasant Creek Powerhouse",426915,72,null,null,0,336,"","","","",""]
[null,"UT",189,"UT-189","Pleasant Grove","Pleasant Grove",426919,765,null,null,0,337,"","","","",""]
[null,"UT",190,"UT-190","Price Game Farm","Price Game Farm",427015,624,null,null,0,338,"","","","",""]
[null,"UT",191,"UT-191","Price Warehouses","Price Warehouses",427026,753,null,null,0,339,"","","","",""]
[null,"UT",192,"UT-192","Provo Airport","Provo Airport",427061,626,null,null,0,340,"","","","",""]
[null,"UT",193,"UT-193","Provo BYU","Provo BYU",427064,1038,null,null,0,341,"","","","",""]
[null,"UT",194,"UT-194","Provo Radio KAYK","Provo Radio KAYK",427068,526,null,null,0,342,"","","","",""]
[null,"UT",195,"UT-195","Randolph","Randolph",427165,35,null,null,0,343,"","","","",""]
[null,"UT",196,"UT-196","Richfield Radio KSVC","Richfield Radio KSVC",427260,423,null,null,0,344,"","","","",""]
[null,"UT",197,"UT-197","Richmond","Richmond",427271,518,null,null,0,345,"","","","",""]
[null,"UT",198,"UT-198","Riverdale","Riverdale",427318,774,null,null,0,346,"","","","",""]
[null,"UT",199,"UT-199","Roosevelt Radio","Roosevelt Radio",427395,557,null,null,0,347,"","","","",""]
[null,"UT",200,"UT-200","Rosette","Rosette",427408,507,null,null,0,348,"","","","",""]
[null,"UT",201,"UT-201","Salina","Salina",427557,582,null,null,0,349,"","","","",""]
[null,"UT",202,"UT-202","Salina 24 SE","Salina 24 SE",427559,108,null,null,0,350,"","","","",""]
[null,"UT",203,"UT-203","Salt Lake City","Salt Lake City",427603,1105,null,null,0,351,"","","","",""]
[null,"UT",204,"UT-204","Salt Lake City NWSFO","Salt Lake City NWSFO",427598,1056,null,null,0,352,"","","","",""]
[null,"UT",205,"UT-205","Salt Lake City Zoo","Salt Lake City Zoo",427655,998,null,null,0,353,"","","","",""]
[null,"UT",206,"UT-206","Salt Lake Triad Center","Salt Lake Triad Center",427606,1278,null,null,0,354,"","","","",""]
[null,"UT",207,"UT-207","Saltair Salt Plant","Saltair Salt Plant",427578,936,null,null,0,355,"","","","",""]
[null,"UT",208,"UT-208","Sandy Ranch","Sandy Ranch",427661,742,null,null,0,356,"","","","",""]
[null,"UT",209,"UT-209","Santaquin Chlorinator","Santaquin Chlorinator",427686,824,null,null,0,357,"","","","",""]
[null,"UT",210,"UT-210","Scipio","Scipio",427714,507,null,null,0,358,"","","","",""]
[null,"UT",211,"UT-211","Scofield","Scofield",427720,1,null,null,0,359,"","","","",""]
[null,"UT",212,"UT-212","Scofield Dam","Scofield Dam",427724,10,null,null,0,360,"","","","",""]
[null,"UT",213,"UT-213","Scofield-Skyland Mine","Scofield-Skyland Mine",427729,20,null,null,0,361,"","","","",""]
[null,"UT",214,"UT-214","Sevier Dry Lake","Sevier Dry Lake",427747,998,null,null,0,362,"","","","",""]
[null,"UT",215,"UT-215","Sigurd UP&L","Sigurd UP&L",427800,589,null,null,0,363,"","","","",""]
[null,"UT",216,"UT-216","Silver Lake Brighton","Silver Lake Brighton",427846,4,null,null,0,364,"","","","",""]
[null,"UT",217,"UT-217","Snake Creek Powerhouse","Snake Creek Powerhouse",427909,109,null,null,0,365,"","","","",""]
[null,"UT",218,"UT-218","Snowville","Snowville",427931,381,null,null,0,366,"","","","",""]
[null,"UT",219,"UT-219","Snyderville","Snyderville",427942,30,null,null,0,367,"","","","",""]
[null,"UT",220,"UT-220","Soldier Summit","Soldier Summit",427959,10,null,null,0,368,"","","","",""]
[null,"UT",221,"UT-221","Spanish Fork 1 S","Spanish Fork 1 S",428114,843,null,null,0,369,"","","","",""]
[null,"UT",222,"UT-222","Spanish Fork Powerhouse","Spanish Fork Powerhouse",428119,925]
[null,"UT",223,"UT-223","St George","St George",427516,2022]
[null,"UT",224,"UT-224","St George CAA Airport","St George CAA Airport",427510,2225]
[null,"UT",225,"UT-225","Sunnyside","Sunnyside",428474,354]
[null,"UT",226,"UT-226","Sunnyside City Center","Sunnyside City Center",428478,536]
[null,"UT",227,"UT-227","Thiokol Plant 78","Thiokol Plant 78",428668,588]
[null,"UT",228,"UT-228","Thompson","Thompson",428705,1160]
[null,"UT",229,"UT-229","Timpanogos Cave","Timpanogos Cave",428733,678]
[null,"UT",230,"UT-230","Toole","Toole",428771,862]
[null,"UT",231,"UT-231","Trementon","Trementon",428817,800]
[null,"UT",232,"UT-232","Trenton","Trenton",428828,307]
[null,"UT",233,"UT-233","Tropic","Tropic",428847,264]
[null,"UT",234,"UT-234","Uintalands","Uintalands",428900,1]
[null,"UT",235,"UT-235","University of Utah","University of Utah",428922,1081]
[null,"UT",236,"UT-236","Utah Lake Lehi","Utah Lake Lehi",428973,553]
[null,"UT",237,"UT-237","Utah Test Range","Utah Test Range",428978,927]
[null,"UT",238,{"$f":"CONCATENATE(B388,\"-\",C388)","v":"UT-238"},"Vernal Arpt","Vernal Arpt",429111,391]
[null,"UT",239,"UT-239","Vernon","Vernon",429133,505]
[null,"UT",240,"UT-240","Veyo Powerhouse","Veyo Powerhouse",429136,1003]
[null,"UT",241,"UT-241","Wah Wah Ranch","Wah Wah Ranch",429152,898]
[null,"UT",242,"UT-242","Wanship Dam","Wanship Dam",429165,169]
[null,"UT",243,"UT-243","Wendover WSO Airport","Wendover WSO Airport",429382,1211]
[null,"UT",244,"UT-244","Woodruff","Woodruff",429595,35]
[null,"UT",245,"UT-245","Woodside","Woodside",429629,924]
[null,"UT",246,"UT-246","Zion National Park","Zion National Park",429717,2073]
[null,"WA",1,{"$f":"CONCATENATE(B397,\"-\",C397)","v":"WA-1"},"Anatone 2 S","Anatone 2 S",450184,162]
[null,"WA",2,"WA-2","Benton City 2 NW","Benton City 2 NW",450628,624]
[null,"WA",3,"WA-3","Bickleton 3 ESE","Bickleton 3 ESE",450668,345]
[null,"WA",4,"WA-4","Cheney","Cheney",451362,319]
[null,"WA",5,"WA-5","Clarkston Heights","Clarkston Heights",451474,470]
[null,"WA",6,"WA-6","Colfax 1 NW","Colfax 1 NW",451586,278]
[null,"WA",7,"WA-7","Connell 1 W","Connell 1 W",451690,627]
[null,"WA",8,"WA-8","Dayton 1 WSW","Dayton 1 WSW",452030,523]
[null,"WA",9,"WA-9","Ellensburg","Ellensburg",452505,340]
[null,"WA",10,"WA-10","Ellensburg FAA Airport","Ellensburg FAA Airport",452508,338]
[null,"WA",11,"WA-11","Eltopia 5 W","Eltopia 5 W",452540,585]
[null,"WA",12,"WA-12","Eltopia 8 WSW","Eltopia 8 WSW",452542,467]
[null,"WA",13,"WA-13","Ephrata","Ephrata",452609,946]
[null,"WA",14,"WA-14","Ephrata Airport FCWOS","Ephrata Airport FCWOS",452614,861]
[null,"WA",15,"WA-15","Harrington 1 N","Harrington 1 N",453512,217]
[null,"WA",16,"WA-16","Harrington 2 S","Harrington 2 S",453513,479]
[null,"WA",17,"WA-17","Harrington 4 ENE","Harrington 4 ENE",453515,249]
[null,"WA",18,"WA-18","Hatton 9 SE","Hatton 9 SE",453546,623]
[null,"WA",19,"WA-19","Ice Harbor Dam","Ice Harbor Dam",453883,822]
[null,"WA",20,"WA-20","John Day Dam","John Day Dam",454035,932]
[null,"WA",21,"WA-21","Kennewick","Kennewick",454154,867]
[null,"WA",22,"WA-22","Kennewick 10 SW","Kennewick 10 SW",454459,757]
[null,"WA",23,"WA-23","La Crosse","La Crosse",454338,443]
[null,"WA",24,"WA-24","Leavenworth 3 S","Leavenworth 3 S",454572,416]
[null,"WA",25,"WA-25","Lind 3 NE Exp Stn","Lind 3 NE Exp Stn",454679,534]
[null,"WA",26,"WA-26","Little Goose Dam","Little Goose Dam",454702,948]
[null,"WA",27,"WA-27","Lower Granite Dam","Lower Granite Dam",454835,1106]
[null,"WA",28,"WA-28","Lower Monumental Dam","Lower Monumental Dam",454841,1005]
[null,"WA",29,"WA-29","Mc Nary Dam","Mc Nary Dam",455231,852]
[null,"WA",30,"WA-30","Moses Lake","Moses Lake",455608,442]
[null,"WA",31,"WA-31","Moses Lake 3","Moses Lake 3",455613,459]
[null,"WA",32,"WA-32","Moxee City 10 E","Moxee City 10 E",455688,385]
[null,"WA",33,"WA-33","Odessa","Odessa",456039,459]
[null,"WA",34,"WA-34","Othello 6 ESE","Othello 6 ESE",456215,538]
[null,"WA",35,"WA-35","Pleasant View","Pleasant View",456553,768]
[null,"WA",36,"WA-36","Pomeroy","Pomeroy",456610,501]
[null,"WA",37,"WA-37","Priest Rapids Dam","Priest Rapids Dam",456747,1190]
[null,"WA",38,"WA-38","Prosser","Prosser",456763,628]
[null,"WA",39,"WA-39","Prosser 4 NE","Prosser 4 NE",456768,548]
[null,"WA",40,"WA-40","Pullman 2 NW","Pullman 2 NW",456789,249]
[null,"WA",41,"WA-41","Pullman Exp Stn","Pullman Exp Stn",456784,314]
[null,"WA",42,"WA-42","Quincy 1 S","Quincy 1 S",456880,617]
[null,"WA",43,"WA-43","Richland","Richland",457015,881]
[null,"WA",44,"WA-44","Ritzville","Ritzville",457059,452]
[null,"WA",45,"WA-45","Rosalia","Rosalia",457180,278]
[null,"WA",46,"WA-46","Ruff 3 SW","Ruff 3 SW",457223,494]
[null,"WA",47,"WA-47","Saint John","Saint John",457267,309]
[null,"WA",48,"WA-48","Satus Pass","Satus Pass",457340,325]
[null,"WA",49,"WA-49","Satus Pass 2 SSW","Satus Pass 2 SSW",457342,169]
[null,"WA",50,"WA-50","Smyrna","Smyrna",457727,836]
[null,"WA",51,"WA-51","Sprague","Sprague",457956,369]
[null,"WA",52,"WA-52","Sunnyside","Sunnyside",458207,685]
[null,"WA",53,"WA-53","Trinidad 2 SSE","Trinidad 2 SSE",458579,1085]
[null,"WA",54,"WA-54","Walla Walla 3 Ent La","Walla Walla 3 Ent La",458926,723]
[null,"WA",55,"WA-55","Walla Walla FAA Airport","Walla Walla FAA Airport",458928,847]
[null,"WA",56,{"$f":"CONCATENATE(B452,\"-\",C452)","v":"WA-56"},"Walla Walla WB City","Walla Walla WB City",458931,873]
[null,"WA",57,"WA-57","Wapato","Wapato",458959,804]
[null,"WA",58,"WA-58","Wawawai","Wawawai",459024,797]
[null,"WA",59,"WA-59","Wenatchee","Wenatchee",459074,751]
[null,"WA",60,"WA-60","Wenatchee Exp Stn","Wenatchee Exp Stn",459079,571]
[null,"WA",61,"WA-61","Wenatchee FAA Airport","Wenatchee FAA Airport",459082,753]
[null,"WA",62,"WA-62","White Swan","White Swan",459191,419]
[null,"WA",63,"WA-63","Whitman Mission","Whitman Mission",459200,529]
[null,"WA",64,"WA-64","Wilson Creek","Wilson Creek",459327,513]
[null,"WA",65,"WA-65","Yakima WSO Ap","Yakima WSO Ap",459465,467]
[null,"WY",1,"WY-1","AFTON","AFTON",480027,9915]
[null,"WY",2,"WY-2","ALBIN","ALBIN",480080,6836]
[null,"WY",3,"WY-3","ALTA 1 NNW","ALTA 1 NNW",480140,9102]
[null,"WY",4,"WY-4","ARCHER","ARCHER",480270,7495]
[null,"WY",5,"WY-5","BAGGS","BAGGS",480484,8169]
[null,"WY",6,"WY-6","BASIN","BASIN",480540,7743]
[null,"WY",7,"WY-7","BATES CREEK NO","BATES CREEK NO",480552,8348]
[null,"WY",8,"WY-8","BEDFORD 3 SE","BEDFORD 3 SE",480603,10184]
[null,"WY",9,"WY-9","BIG PINEY       BPI","BIG PINEY       BPI",480695,10669]
[null,"WY",10,"WY-10","BILLY CREEK","BILLY CREEK",480740,8200]
[null,"WY",11,"WY-11","BITTER CREEK 4","BITTER CREEK 4",480761,8685]
[null,"WY",12,"WY-12","BLACK MOUNTAIN","BLACK MOUNTAIN",480778,7522]
[null,"WY",13,"WY-13","BONDURANT","BONDURANT",480865,11782]
[null,"WY",14,"WY-14","BORDER 3 N","BORDER 3 N",480915,9493]
[null,"WY",15,"WY-15","BOULDER REARING","BOULDER REARING",480951,10784]
[null,"WY",16,"WY-16","BOYSEN DAM","BOYSEN DAM",481000,7804]
[null,"WY",17,"WY-17","BUFFALO","BUFFALO",481165,7879]
[null,"WY",18,"WY-18","BUFFALO BILL DA","BUFFALO BILL DA",481175,7188]
[null,"WY",19,"WY-19","BURGESS JUNCTIO","BURGESS JUNCTIO",481220,11713]
[null,"WY",20,"WY-20","BURRIS","BURRIS",481284,8394]
[null,"WY",21,"WY-21","CARPENTER","CARPENTER",481547,7012]
[null,"WY",22,"WY-22","CASPER NATRONA  CPR","CASPER NATRONA  CPR",481570,7571]
[null,"WY",23,"WY-23","CENTENNIAL 1 N","CENTENNIAL 1 N",481610,9120]
[null,"WY",24,"WY-24","CHEYENNE MUNICI CYS","CHEYENNE MUNICI CYS",481675,7388]
[null,"WY",25,"WY-25","CHUGWATER","CHUGWATER",481730,7561]
[null,"WY",26,"WY-26","CHURCH BUTTES G","CHURCH BUTTES G",481736,8957]
[null,"WY",27,"WY-27","CLARK 3 NE","CLARK 3 NE",481775,7992]
[null,"WY",28,"WY-28","CLEARMONT 5 SW","CLEARMONT 5 SW",481816,8509]
[null,"WY",29,"WY-29","CODY","CODY",481840,7243]
[null,"WY",30,"WY-30","CODY 12 SE","CODY 12 SE",481850,7937]
[null,"WY",31,"WY-31","CODY 21 SW","CODY 21 SW",481855,7870]
[null,"WY",32,"WY-32","COLONY","COLONY",481905,7250]
[null,"WY",33,"WY-33","CORA","CORA",482054,10917]
[null,"WY",34,"WY-34","DANIEL FISH HAT","DANIEL FISH HAT",482242,11404]
[null,"WY",35,"WY-35","DARWIN RANCH","DARWIN RANCH",482375,12809]
[null,"WY",36,"WY-36","DEAD HORSE CREE","DEAD HORSE CREE",482410,8123]
[null,"WY",37,"WY-37","DEAVER","DEAVER",482415,8096]
[null,"WY",38,"WY-38","DEVILS TOWER 2","DEVILS TOWER 2",482466,8308]
[null,"WY",39,"WY-39","DILLINGER","DILLINGER",482580,8034]
[null,"WY",40,"WY-40","DIVERSION DAM","DIVERSION DAM",482595,8335]
[null,"WY",41,"WY-41","DOUBLE FOUR RAN","DOUBLE FOUR RAN",482680,8197]
[null,"WY",42,"WY-42","DOUGLAS AVIATIO","DOUGLAS AVIATIO",482693,7433]
[null,"WY",43,"WY-43","DUBOIS","DUBOIS",482715,9245]
[null,"WY",44,"WY-44","DULL CENTER 1 S","DULL CENTER 1 S",482725,7284]
[null,"WY",45,"WY-45","ECHETA 2 NW","ECHETA 2 NW",482881,7841]
[null,"WY",46,"WY-46","ELK MOUNTAIN","ELK MOUNTAIN",482995,8738]
[null,"WY",47,"WY-47","EMBLEM","EMBLEM",483031,7708]
[null,"WY",48,"WY-48","ENCAMPMENT 10 E","ENCAMPMENT 10 E",483045,8858]
[null,"WY",49,"WY-49","EVANSTON 1 E","EVANSTON 1 E",483100,9054]
[null,"WY",50,"WY-50","FARSON 5 N","FARSON 5 N",483170,10347]
[null,"WY",51,"WY-51","FONTENELLE DAM","FONTENELLE DAM",483396,10505]
[null,"WY",52,"WY-52","GAS HILLS 4 E","GAS HILLS 4 E",483801,8619]
[null,"WY",53,"WY-53","GILLETTE 6 SE   GCC","GILLETTE 6 SE   GCC",483855,8034]
[null,"WY",54,"WY-54","GLENROCK 5 ESE","GLENROCK 5 ESE",483950,6835]
[null,"WY",55,{"$f":"CONCATENATE(B516,\"-\",C516)","v":"WY-55"},"GLENROCK 14 SSE","GLENROCK 14 SSE",483960,8406]
[null,"WY",56,"WY-56","GRASS CREEK","GRASS CREEK",484036,7945]
[null,"WY",57,"WY-57","GREEN RIVER","GREEN RIVER",484065,8183]
[null,"WY",58,"WY-58","GREYBULL","GREYBULL",484080,7966]
[null,"WY",59,"WY-59","HEART MOUNTAIN","HEART MOUNTAIN",484411,7421]
[null,"WY",60,"WY-60","HULETT","HULETT",484760,7899]
[null,"WY",61,"WY-61","JACKSON","JACKSON",484910,9529]
[null,"WY",62,"WY-62","JEFFREY CITY","JEFFREY CITY",484925,8750]
[null,"WY",63,"WY-63","KAYCEE","KAYCEE",485055,7896]
[null,"WY",64,"WY-64","KEELINE 3 W","KEELINE 3 W",485085,7640]
[null,"WY",65,"WY-65","KEELINE 7 SW","KEELINE 7 SW",485088,7646]
[null,"WY",66,"WY-66","KEMMERER 2 N","KEMMERER 2 N",485105,9767]
[null,"WY",67,"WY-67","LA BARGE","LA BARGE",485252,10026]
[null,"WY",68,"WY-68","LA GRANGE","LA GRANGE",485260,6461]
[null,"WY",69,"WY-69","LAKE YELLOWSTON P60","LAKE YELLOWSTON P60",485345,12223]
[null,"WY",70,"WY-70","LANDER AP       LND","LANDER AP       LND",485390,7790]
[null,"WY",71,"WY-71","LARAMIE RGNL AP LAR","LARAMIE RGNL AP LAR",485415,9038]
[null,"WY",72,"WY-72","LARAMIE 2 NW","LARAMIE 2 NW",485435,9233]
[null,"WY",73,"WY-73","LEITER 9 N","LEITER 9 N",485506,7398]
[null,"WY",74,"WY-74","LOVELL","LOVELL",485770,7932]
[null,"WY",75,"WY-75","LUSK 2 SW","LUSK 2 SW",485830,7991]
[null,"WY",76,"WY-76","MEDICINE BOW","MEDICINE BOW",486120,8338]
[null,"WY",77,"WY-77","MERNA","MERNA",486165,10959]
[null,"WY",78,"WY-78","MIDWEST","MIDWEST",486195,7537]
[null,"WY",79,"WY-79","MOORCROFT 3 S","MOORCROFT 3 S",486395,8360]
[null,"WY",80,"WY-80","MOOSE","MOOSE",486428,10296]
[null,"WY",81,"WY-81","MORAN 5 WNW","MORAN 5 WNW",486440,10210]
[null,"WY",82,"WY-82","MOUNTAIN VIEW","MOUNTAIN VIEW",486555,8364]
[null,"WY",83,"WY-83","MUDDY GAP","MUDDY GAP",486595,7681]
[null,"WY",84,"WY-84","NEWCASTLE","NEWCASTLE",486660,7426]
[null,"WY",85,"WY-85","OLD FAITHFUL","OLD FAITHFUL",486845,11468]
[null,"WY",86,"WY-86","OLD FORT LARAMI","OLD FORT LARAMI",486852,7030]
[null,"WY",87,"WY-87","PATHFINDER DAM","PATHFINDER DAM",487105,7369]
[null,"WY",88,"WY-88","PAVILLION","PAVILLION",487115,7784]
[null,"WY",89,"WY-89","PHILLIPS","PHILLIPS",487200,6944]
[null,"WY",90,"WY-90","PINE BLUFFS","PINE BLUFFS",487235,7123]
[null,"WY",91,"WY-91","PINE BLUFFS 5 W","PINE BLUFFS 5 W",487240,7398]
[null,"WY",92,"WY-92","PINEDALE","PINEDALE",487260,10634]
[null,"WY",93,"WY-93","POWDER RIVER NO","POWDER RIVER NO",487376,7925]
[null,"WY",94,"WY-94","POWELL FIELD ST","POWELL FIELD ST",487388,8122]
[null,"WY",95,"WY-95","RAWLINS AP      RWL","RAWLINS AP      RWL",487533,7885]
[null,"WY",96,"WY-96","RECLUSE 11 NNW","RECLUSE 11 NNW",487548,8941]
[null,"WY",97,"WY-97","REDBIRD","REDBIRD",487555,7316]
[null,"WY",98,"WY-98","RIVERTON","RIVERTON",487760,8365]
[null,"WY",99,"WY-99","ROCHELLE 3 E","ROCHELLE 3 E",487810,8123]
[null,"WY",100,"WY-100","ROCK SPRINGS AP","ROCK SPRINGS AP",487845,8670]
[null,"WY",101,"WY-101","SAGE 4 NNW","SAGE 4 NNW",487955,9717]
[null,"WY",102,"WY-102","SARATOGA","SARATOGA",487990,8107]
[null,"WY",103,"WY-103","SEMINOE DAM","SEMINOE DAM",488070,8020]
[null,"WY",104,"WY-104","SHELL","SHELL",488124,8075]
[null,"WY",105,"WY-105","SHERIDAN AP     SHR","SHERIDAN AP     SHR",488155,7721]
[null,"WY",106,"WY-106","SHERIDAN FIELD","SHERIDAN FIELD",488160,7827]
[null,"WY",107,"WY-107","SHIRLEY BASIN","SHIRLEY BASIN",488192,10847]
[null,"WY",108,"WY-108","SNAKE RIVER","SNAKE RIVER",488315,11565]
[null,"WY",109,"WY-109","SOUTH PASS CITY","SOUTH PASS CITY",488385,11547]
[null,"WY",110,"WY-110","SUNDANCE","SUNDANCE",488705,8166]
[null,"WY",111,"WY-111","SUNSHINE 3 NE","SUNSHINE 3 NE",488758,9401]
[null,"WY",112,"WY-112","SYBILLE RESEARC","SYBILLE RESEARC",488808,7754]
[null,"WY",113,"WY-113","TEN SLEEP 4 NE","TEN SLEEP 4 NE",488852,6748]
[null,"WY",114,"WY-114","TEN SLEEP 16 SS","TEN SLEEP 16 SS",488858,8654]
[null,"WY",115,"WY-115","THERMOPOLIS","THERMOPOLIS",488875,6877]
[null,"WY",116,"WY-116","THERMOPOLIS 2","THERMOPOLIS 2",488880,7502]
[null,"WY",117,"WY-117","THERMOPOLIS 25","THERMOPOLIS 25",488888,8323]
[null,"WY",118,"WY-118","TORRINGTON EXP","TORRINGTON EXP",488995,6908]
[null,"WY",119,{"$f":"CONCATENATE(B580,\"-\",C580)","v":"WY-119"},"TOWER FALLS","TOWER FALLS",489025,10726]
[null,"WY",120,"WY-120","UPTON","UPTON",489205,7952]
[null,"WY",121,"WY-121","WAMSUTTER","WAMSUTTER",489459,8998]
[null,"WY",122,"WY-122","WAPITI 1 NE","WAPITI 1 NE",489467,7882]
[null,"WY",123,"WY-123","WESTON 1 E","WESTON 1 E",489580,7332]
[null,"WY",124,"WY-124","WHALEN DAM (USB","WHALEN DAM (USB",489604,6389]
[null,"WY",125,"WY-125","WHEATLAND 4 N","WHEATLAND 4 N",489615,6321]
[null,"WY",126,"WY-126","WORLAND","WORLAND",489770,7928]
[null,"WY",127,"WY-127","WORLAND MUNICIP WRL","WORLAND MUNICIP WRL",489785,7426]
[null,"WY",128,"WY-128","YELLOWSTONE PAR","YELLOWSTONE PAR",489905,9488]
[null,"WY",129,"WY-129","YODER 2 WSW","YODER 2 WSW",489925,6695]

{"sheet":"Degree Days","index":6,"n_rows":857,"n_cols":19,"rows_kept":857,"cut":false,"hidden":true,"merged":[[0,5,0,11],[0,12,0,18]]}
[null,null,"Degree Days",null,null,"Heating Base°",null,null,null,null,null,null,"Cooling Base°"]
["State","Ref","State-Ref","COOP ID","Station Name",65,60,57,55,50,45,40,70,65,60,57,55,50,45]
["CA",1,{"$f":"CONCATENATE(A3,\"-\",B3)","v":"CA-1"},40029,"ADIN RS",5988,4577,3821,3356,2340,1518,901,85,300,715,1055,1320,2103,3048]
["CA",{"$f":"IF(A3=A4,B3+1,1)","v":2},{"$f":"CONCATENATE(A4,\"-\",B4)","v":"CA-2"},40136,"ALPINE",1926,1064,683,485,156,37,0,726,1382,2320,3029,3564,5061,6765]
["CA",3,"CA-3",40161,"ALTURAS",6808,5291,4474,3968,2857,1939,1235,59,212,519,798,1019,1701,2549]
["CA",4,"CA-4",40192,"ANAHEIM         FUL",1286,556,287,165,27,0,0,561,1294,2391,3219,3824,5514,7311]
["CA",5,"CA-5",40212,"ANGWIN PAC UNIO",3426,2273,1699,1362,697,282,76,243,659,1333,1853,2247,3407,4817]
["CA",6,"CA-6",40232,"ANTIOCH PUMP PL",2714,1752,1281,1011,493,205,63,544,1179,2039,2667,3125,4437,5971]
["CA",7,"CA-7",40343,"ASH MOUNTAIN",2741,1807,1334,1060,530,210,59,1247,1976,2868,3491,3946,5242,6746]
["CA",8,"CA-8",40379,"AUBERRY 2 NW",2868,1916,1429,1142,587,240,72,1206,1922,2796,3404,3845,5116,6594]
["CA",9,"CA-9",40383,"AUBURN",2992,1976,1458,1157,565,212,52,744,1366,2174,2752,3181,4414,5887]
["CA",10,"CA-10",40395,"AVALON PLEASURE",1589,694,362,210,37,0,0,251,749,1682,2445,3027,4674,6465]
["CA",11,"CA-11",40436,"BAKER",2011,1272,911,703,322,116,27,2659,3607,4694,5427,5950,7395,9012]
["CA",12,"CA-12",40442,"BAKERSFIELD KER BFL",2120,1277,881,664,276,82,16,1479,2286,3290,3991,4503,5939,7571]
["CA",13,"CA-13",40449,"BALCH POWER HOU",3045,2058,1544,1239,625,244,62,1109,1794,2633,3217,3640,4850,6298]
["CA",14,"CA-14",40521,"BARSTOW FIRE ST",2294,1472,1067,834,396,147,36,1715,2566,3573,4263,4758,6146,7721]
["CA",15,"CA-15",40609,"BEAUMONT 1 E",2146,1288,871,653,259,70,11,861,1572,2507,3186,3696,5130,6766]
["CA",16,"CA-16",40673,"BEN LOMOND NO 4",2871,1702,1160,863,338,82,11,79,400,1058,1611,2042,3342,4914]
["CA",17,"CA-17",40693,"BERKELEY",2857,1525,959,673,214,38,1,9,142,627,1158,1603,2967,4615]
["CA",18,"CA-18",40738,"BIG BAR 4 E",3831,2698,2108,1752,1007,479,176,446,939,1629,2135,2511,3590,4886]
["CA",19,"CA-19",40741,"BIG BEAR LAKE",6548,5045,4216,3712,2585,1657,943,8,89,346,612,836,1519,2362]
["CA",{"$f":"IF(A21=A22,B21+1,1)","v":20},"CA-20",40822,"BISHOP AP       BIH",4314,3165,2555,2182,1371,745,331,480,1003,1692,2178,2535,3550,4747]
["CA",21,"CA-21",40897,"BLUE CANYON     BLU",5545,4236,3507,3058,2064,1268,703,157,423,871,1232,1503,2296,3228]
["CA",22,"CA-22",40924,"BLYTHE",1295,690,425,294,90,17,0,2935,3977,5201,6032,6631,8252,10004]
["CA",23,"CA-23",40927,"BLYTHE AP       BLH",1226,654,414,294,100,25,3,3102,4166,5419,6274,6884,8516,10266]
["CA",24,"CA-24",40931,"BOCA",8107,6419,5485,4907,3614,2559,1706,3,35,172,332,485,1009,1720]
["CA",25,"CA-25",40943,"BODIE",9770,8068,7046,6395,4910,3647,2582,0,4,39,113,191,518,1044]
["CA",26,"CA-26",40983,"BORREGO DESERT",1130,582,356,241,70,11,0,2851,3928,5204,6074,6688,8343,10108]
["CA",27,"CA-27",41018,"BOWMAN DAM",6193,4806,4029,3551,2477,1594,913,102,311,679,995,1241,1966,2834]
["CA",28,"CA-28",41048,"BRAWLEY 2 SW",1155,583,347,233,62,11,0,2682,3733,4985,5845,6463,8115,9891]
["CA",29,"CA-29",41072,"BRIDGEPORT",8439,6755,5824,5246,3949,2876,1996,3,37,179,343,495,1009,1699]
["CA",30,"CA-30",41112,"BROOKS FARNHAM",2815,1837,1336,1044,478,160,30,725,1393,2240,2835,3275,4533,6039]
["CA",31,"CA-31",41194,"BURBANK VALLEY  BUR",1575,776,456,298,71,8,0,734,1455,2482,3257,3831,5428,7191]
["CA",32,"CA-32",41214,"BURNEY",6495,4970,4156,3652,2534,1630,953,51,196,497,778,1003,1701,2581]
["CA",33,"CA-33",41244,"BUTTONWILLOW",2668,1775,1323,1063,551,251,86,1097,1857,2787,3431,3902,5217,6739]
["CA",34,"CA-34",41253,"CACHUMA LAKE",1994,1085,684,483,148,29,0,374,970,1885,2583,3111,4599,6306]
["CA",35,"CA-35",41277,"CALAVERAS BIG T",5924,4569,3812,3341,2290,1425,777,88,308,714,1051,1313,2066,2960]
["CA",36,"CA-36",41312,"CALISTOGA",2811,1783,1276,988,438,138,22,285,819,1613,2205,2647,3920,5445]
["CA",37,"CA-37",41316,"CALLAHAN",5493,4096,3356,2902,1905,1122,566,90,315,742,1096,1371,2198,3206]
["CA",38,"CA-38",41424,"CAMPO           CZZ",3133,1987,1422,1096,490,152,30,370,821,1502,2033,2436,3655,5140]
["CA",39,"CA-39",41428,"CAMP PARDEE",2758,1802,1326,1050,520,212,61,845,1534,2403,3023,3476,4771,6290]
["CA",40,"CA-40",803154,"CAMP PENDLETON",1783,909,548,365,92,13,0,327,904,1830,2565,3113,4664,6410]
["CA",41,"CA-41",41476,"CANBY 3 SW",6842,5320,4500,3993,2875,1960,1247,51,199,503,780,1002,1685,2536]
["CA",42,"CA-42",41484,"CANOGA PARK PIE",1822,978,609,423,121,20,0,772,1485,2465,3191,3739,5262,6986]
["CA",43,"CA-43",41497,"CANYON DAM",6609,5119,4321,3825,2712,1776,1038,70,247,584,881,1114,1821,2681]
["CA",44,"CA-44",41606,"CECILVILLE",5116,3804,3111,2681,1744,1002,484,285,615,1129,1526,1829,2711,3765]
["CA",45,"CA-45",41614,"CEDARVILLE",6589,5182,4416,3939,2879,1988,1284,169,420,839,1168,1418,2155,3027]
["CA",46,"CA-46",41697,"CHERRY VALLEY D",4942,3737,3069,2656,1745,1030,534,277,656,1221,1648,1961,2857,3913]
["CA",47,"CA-47",41700,"CHESTER",6743,5233,4426,3925,2806,1864,1115,39,184,496,785,1013,1712,2560]
["CA",48,"CA-48",41715,"CHICO UNIVERSIT",2945,1964,1458,1166,581,232,63,681,1334,2177,2769,3206,4446,5921]
["CA",49,"CA-49",41758,"CHULA VISTA",1321,517,244,127,15,0,0,282,862,1882,2706,3318,5031,6841]
["CA",50,"CA-50",41806,"CLEARLAKE 4 SE",3804,2627,2019,1655,894,384,111,315,753,1403,1890,2254,3317,4632]
["CA",51,"CA-51",41838,"CLOVERDALE",2639,1676,1197,924,400,116,16,494,1127,1987,2604,3061,4361,5903]
["CA",52,"CA-52",41864,"COALINGA",2234,1399,987,755,339,122,31,1384,2204,3194,3880,4376,5786,7394]
["CA",53,"CA-53",41912,"COLFAX",3512,2396,1822,1480,789,340,102,591,1116,1827,2347,2734,3867,5244]
["CA",54,"CA-54",41948,"COLUSA 2 SSW",2702,1762,1290,1018,483,182,42,705,1401,2288,2910,3369,4660,6182]
["CA",55,"CA-55",42012,"CORCORAN IRRIG",2507,1633,1199,946,471,203,66,1122,1909,2860,3520,3999,5346,6905]
["CA",56,"CA-56",42031,"CORONA",1599,807,480,317,75,8,0,788,1534,2565,3334,3902,5487,7242]
["CA",57,"CA-57",42081,"COVELO",3925,2730,2108,1737,965,433,144,277,684,1316,1790,2147,3198,4492]
["CA",58,"CA-58",42147,"CRESCENT CITY 3 CEC",4687,2980,2078,1565,682,230,49,0,6,81,274,490,1434,2807]
["CA",59,"CA-59",42214,"CULVER CITY",1344,548,266,142,18,0,0,350,959,1989,2802,3408,5108,6916]
["CA",60,"CA-60",42239,"CUYAMACA",4988,3707,2999,2564,1616,886,405,168,457,948,1332,1627,2494,3559]
["CA",61,"CA-61",42257,"DAGGETT BARSTOW DAG",2228,1437,1044,816,397,153,40,2035,2915,3946,4648,5152,6555,8139]
["CA",62,"CA-62",42294,"DAVIS 2 WSW EXP",2853,1870,1375,1091,534,212,57,502,1127,1968,2569,3017,4281,5784]
["CA",63,"CA-63",42319,"DEATH VALLEY",1257,713,465,336,125,29,5,4169,5296,6575,7423,8025,9637,11368]
["CA",64,"CA-64",42331,"DEEP SPRINGS CO",5293,4097,3451,3046,2133,1378,794,384,843,1472,1921,2246,3154,4186]
["CA",65,"CA-65",42338,"DEER CREEK FORE",4739,3549,2893,2494,1623,963,501,317,692,1274,1713,2045,2998,4164]
["CA",66,{"$f":"CONCATENATE(A68,\"-\",B68)","v":"CA-66"},42402,"DE SABLA",4040,2868,2258,1891,1115,564,219,358,806,1459,1945,2307,3355,4630]
["CA",67,"CA-67",42456,"DOBBINS 1 S",3418,2308,1730,1384,690,263,62,444,969,1683,2200,2586,3716,5113]
["CA",68,"CA-68",42467,"DONNER MEMORIAL",8284,6608,5680,5102,3805,2705,1805,5,44,194,360,511,1024,1709]
["CA",69,"CA-69",42500,"DOWNIEVILLE",4782,3483,2806,2394,1496,808,361,139,438,967,1383,1700,2620,3728]
["CA",70,"CA-70",42506,"DOYLE 4 SSE",6013,4599,3842,3379,2368,1554,948,95,314,724,1064,1330,2113,3071]
["CA",71,"CA-71",42516,"DRY CANYON RESE",2502,1521,1051,792,331,89,15,550,1139,1984,2609,3078,4441,6025]
["CA",72,"CA-72",42574,"DUNSMUIR TREATM",4711,3426,2754,2346,1458,785,345,177,503,1044,1466,1788,2722,3848]
["CA",73,"CA-73",42598,"EAGLE MOUNTAIN",1131,594,370,257,80,17,0,3171,4277,5563,6432,7052,8699,10459]
["CA",74,"CA-74",42640,"EAST PARK RESER",3498,2410,1841,1498,797,336,95,533,1082,1817,2342,2728,3854,5220]
["CA",75,"CA-75",42706,"EL CAJON",1560,760,440,286,66,7,0,652,1371,2397,3173,3748,5352,7120]
["CA",76,"CA-76",42709,"EL CAPITAN DAM",1419,691,405,261,60,4,0,904,1712,2808,3615,4202,5829,7595]
["CA",77,"CA-77",42713,"EL CENTRO 2 SSW",1080,531,308,203,48,7,0,2874,3952,5228,6103,6727,8397,10181]
["CA",78,"CA-78",42728,"ELECTRA P H",2854,1842,1333,1041,481,172,37,602,1218,2031,2619,3054,4321,5836]
["CA",79,"CA-79",42771,"EL MIRAGE",3616,2564,2007,1679,972,485,200,767,1370,2142,2681,3082,4201,5539]
["CA",80,"CA-80",42805,"ELSINORE",1924,1092,714,517,183,42,5,1102,1874,2867,3583,4116,5608,7292]
["CA",81,"CA-81",893101,"EL TORO MCAS",1461,692,390,244,56,5,0,524,1183,2227,3022,3605,5242,7017]
["CA",82,"CA-82",42863,"ESCONDIDO NO 2",1464,690,381,235,44,2,0,696,1436,2485,3275,3858,5493,7276]
["CA",83,"CA-83",42910,"EUREKA WFO WOOD",4403,2713,1838,1352,555,167,35,0,7,98,320,562,1592,3029]
["CA",{"$f":"IF(A85=A86,B85+1,1)","v":84},"CA-84",42934,"FAIRFIELD",2649,1674,1210,945,450,180,52,381,975,1826,2455,2920,4250,5805]
["CA",85,"CA-85",42941,"FAIRMONT",3199,2205,1698,1394,785,377,140,953,1608,2439,3027,3454,4671,6088]
["CA",86,"CA-86",43083,"FIVE POINTS 5 S",2446,1577,1145,894,428,171,48,1016,1784,2739,3405,3883,5241,6810]
["CA",87,"CA-87",43113,"FOLSOM DAM",2532,1612,1166,907,424,158,39,817,1528,2433,3082,3552,4896,6455]
["CA",88,"CA-88",43120,"FONTANA KAISER  ONT",1351,687,404,259,65,6,0,1066,1905,3034,3847,4433,6064,7831]
["CA",89,"CA-89",43157,"FORT BIDWELL",6653,5193,4407,3919,2851,1964,1270,87,281,648,957,1199,1924,2809]
["CA",90,"CA-90",43161,"FORT BRAGG 5 N",4266,2576,1715,1240,483,135,25,0,6,108,342,597,1666,3145]
["CA",91,"CA-91",43191,"FORT ROSS",4234,2536,1665,1183,431,102,13,0,6,99,325,574,1645,3140]
["CA",92,"CA-92",43257,"FRESNO YOSEMITE FAT",2447,1538,1102,853,381,119,21,1226,1963,2932,3590,4069,5423,6985]
["CA",93,"CA-93",43261,"FRIANT GOVERNME",2672,1743,1279,1010,498,206,61,992,1708,2604,3235,3697,5010,6543]
["CA",94,"CA-94",43417,"GILROY",2278,1328,891,655,253,66,11,325,913,1794,2450,2944,4366,6005]
["CA",95,"CA-95",43463,"GLENNVILLE",4466,3202,2519,2103,1228,604,230,140,427,940,1350,1664,2615,3819]
["CA",96,"CA-96",43551,"GRANT GROVE",6844,5373,4539,4027,2876,1914,1159,32,155,431,691,900,1540,2313]
["CA",97,"CA-97",43573,"GRASS VALLEY NO",4287,3038,2387,1994,1156,565,205,247,612,1187,1630,1968,2956,4188]
["CA",98,"CA-98",43578,"GRATON",3179,1946,1370,1051,468,157,32,39,288,879,1400,1811,3053,4568]
["CA",99,"CA-99",43647,"GRIZZLY CREEK S",4610,3063,2306,1867,998,442,141,0,38,315,651,946,1899,3171]
["CA",100,"CA-100",43710,"HAIWEE",3784,2740,2183,1843,1126,600,274,814,1441,2221,2758,3151,4245,5517]
["CA",101,"CA-101",43714,"HALF MOON BAY",3737,2107,1309,898,277,48,1,0,11,172,468,788,1991,3588]
["CA",102,"CA-102",43747,"HANFORD 1 S",2749,1841,1384,1114,580,262,90,978,1724,2641,3278,3739,5028,6534]
["CA",103,"CA-103",43761,"HAPPY CAMP RANG",4255,3027,2388,2001,1186,595,241,281,671,1267,1723,2069,3076,4295]
["CA",104,"CA-104",43824,"HAT CREEK",5685,4278,3535,3079,2072,1270,678,96,314,733,1080,1354,2169,3156]
["CA",105,"CA-105",43855,"HAYFIELD PUMPIN",1588,905,592,428,155,35,5,2241,3196,4336,5119,5684,7238,8942]
["CA",106,"CA-106",43875,"HEALDSBURG",2501,1508,1039,778,315,85,13,296,853,1680,2305,2776,4135,5733]
["CA",107,"CA-107",43914,"HENSHAW DAM",3651,2450,1837,1471,740,289,70,368,786,1410,1891,2258,3350,4724]
["CA",108,"CA-108",43939,"HETCH HETCHY",4740,3492,2836,2437,1566,892,434,254,619,1196,1636,1965,2908,4030]
["CA",109,"CA-109",44025,"HOLLISTER 2",2724,1589,1075,798,320,86,13,81,405,1091,1676,2128,3476,5065]
["CA",110,"CA-110",44176,"HUNTINGTON LAKE",6992,5451,4557,4004,2783,1788,1045,19,93,301,503,675,1236,1970]
["CA",111,"CA-111",44211,"IDYLLWILD FIRE",5071,3751,3033,2595,1653,938,456,97,333,776,1153,1446,2330,3439]
["CA",112,"CA-112",44223,"IMPERIAL        IPL",1115,550,321,213,51,8,0,2707,3764,5021,5886,6510,8173,9956]
["CA",113,"CA-113",44232,"INDEPENDENCE",3579,2588,2061,1750,1071,584,271,1111,1804,2638,3209,3628,4772,6109]
["CA",114,"CA-114",44259,"INDIO FIRE STAT",903,434,253,166,40,7,0,3229,4388,5743,6657,7299,8999,10791]
["CA",115,"CA-115",44278,"INYOKERN",2633,1762,1323,1060,546,234,71,1533,2340,3294,3951,4418,5730,7242]
["CA",116,"CA-116",44297,"IRON MOUNTAIN",1156,620,393,280,95,23,2,3366,4476,5764,6634,7251,8892,10644]
["CA",117,"CA-117",44374,"JESS VALLEY",7575,6000,5136,4600,3386,2373,1552,43,158,408,640,828,1414,2150]
["CA",118,"CA-118",44500,"KENTFIELD",2567,1508,1026,760,302,86,14,136,557,1320,1933,2396,3763,5371]
["CA",119,"CA-119",44520,"KERN RIVER PH 1",1645,965,646,476,196,52,12,2268,3236,4380,5155,5716,7259,8942]
["CA",120,"CA-120",44523,"KERN RIVER PH 3",3103,2100,1586,1279,663,277,81,936,1593,2415,2996,3420,4629,6068]
["CA",121,"CA-121",44555,"KING CITY",2384,1368,906,659,246,58,9,145,598,1409,2040,2525,3936,5575]
["CA",122,"CA-122",44577,"KLAMATH",4514,2816,1955,1482,656,220,45,0,5,92,327,584,1586,2973]
["CA",123,"CA-123",44647,"LAGUNA BEACH",1756,800,428,259,44,0,0,214,666,1526,2253,2813,4422,6205]
["CA",124,"CA-124",44671,"LAKE ARROWHEAD",5450,4104,3392,2952,1977,1190,619,177,462,941,1321,1613,2453,3442]
["CA",125,"CA-125",44701,"LAKEPORT",3698,2545,1949,1593,854,358,98,334,793,1465,1964,2338,3424,4753]
["CA",126,"CA-126",44712,"LAKE SOLANO",2716,1775,1303,1032,500,195,50,732,1420,2305,2924,3387,4678,6198]
["CA",127,"CA-127",44713,"LAKE SPAULDING",6321,4881,4077,3579,2469,1545,845,35,179,498,792,1023,1721,2570]
["CA",128,"CA-128",44735,"LA MESA",1313,559,285,160,24,0,0,559,1261,2332,3153,3758,5449,7249]
["CA",129,"CA-129",44749,"LANCASTER ATC   WJF",3241,2244,1725,1414,774,358,134,1048,1733,2560,3137,3556,4739,6151]
["CA",130,{"$f":"CONCATENATE(A132,\"-\",B132)","v":"CA-130"},44838,"LAVA BEDS NAT M",6395,4978,4212,3733,2664,1777,1081,148,387,798,1125,1376,2116,2996]
["CA",131,"CA-131",44881,"LEE VINING",6513,5087,4321,3848,2783,1889,1178,75,281,680,1009,1265,2018,2914]
["CA",132,"CA-132",44890,"LEMON COVE",2336,1480,1060,823,387,154,45,1149,1939,2908,3584,4074,5465,7056]
["CA",133,"CA-133",823110,"LEMOORE REEVES",2660,1750,1300,1035,524,227,71,947,1680,2597,3241,3706,5020,6546]
["CA",134,"CA-134",44957,"LINDSAY",2505,1601,1156,898,424,166,45,966,1707,2626,3275,3749,5099,6666]
["CA",135,"CA-135",44997,"LIVERMORE",2755,1720,1223,938,416,142,31,332,858,1652,2248,2693,3997,5548]
["CA",136,"CA-136",45026,"LODGEPOLE",8399,6781,5844,5261,3946,2824,1881,0,31,164,323,466,965,1624]
["CA",137,"CA-137",45032,"LODI",2710,1717,1245,975,476,201,64,464,1057,1890,2512,2972,4296,5846]
["CA",138,"CA-138",45064,"LOMPOC",2241,1104,647,423,104,10,0,55,322,987,1622,2133,3636,5368]
["CA",139,"CA-139",45085,"LONG BEACH AP   LGB",1211,472,213,108,14,1,0,473,1186,2270,3106,3731,5461,7274]
["CA",140,"CA-140",45114,"LOS ANGELES INT LAX",1274,458,187,88,8,0,0,169,679,1677,2499,3130,4877,6695]
["CA",141,"CA-141",45115,"LOS ANGELES DOW CQT",928,332,146,76,10,0,0,654,1506,2723,3630,4290,6050,7865]
["CA",142,"CA-142",45118,"LOS BANOS",2570,1662,1216,959,468,195,60,823,1547,2466,3116,3589,4923,6476]
["CA",143,"CA-143",45120,"LOS BANOS DET R",2490,1589,1150,894,425,170,50,981,1726,2653,3307,3781,5136,6708]
["CA",144,"CA-144",45123,"LOS GATOS",2641,1570,1068,790,314,88,16,169,613,1368,1961,2413,3763,5359]
["CA",145,"CA-145",45233,"MADERA",2670,1748,1286,1020,504,213,68,977,1706,2610,3243,3706,5016,6551]
["CA",146,"CA-146",45311,"MANZANITA LAKE",7486,5943,5054,4504,3272,2241,1400,17,90,301,507,683,1255,1990]
["CA",147,"CA-147",45338,"MARICOPA",2190,1376,977,755,356,141,41,1502,2334,3343,4041,4549,5974,7582]
["CA",{"$f":"IF(A149=A150,B149+1,1)","v":148},"CA-148",45356,"MARKLEEVILLE",7091,5501,4647,4120,2945,1977,1208,13,97,331,573,774,1415,2222]
["CA",149,"CA-149",45360,"MARKLEY COVE",2996,1975,1456,1157,564,212,51,518,1111,1915,2493,2924,4156,5628]
["CA",150,"CA-150",45378,"MARTINEZ WATER",2757,1724,1233,952,442,166,44,279,786,1578,2182,2632,3946,5497]
["CA",151,"CA-151",45385,"MARYSVILLE",2488,1595,1158,905,430,167,44,952,1687,2620,3277,3755,5106,6668]
["CA",152,"CA-152",45449,"MC CLOUD",5641,4259,3523,3070,2067,1260,668,124,368,811,1170,1446,2259,3226]
["CA",153,"CA-153",45502,"MECCA FIRE STAT",1118,576,351,242,69,13,0,2866,3958,5243,6113,6732,8385,10154]
["CA",154,"CA-154",45532,"MERCED",2602,1675,1223,958,465,194,60,862,1578,2476,3118,3582,4913,6470]
["CA",155,"CA-155",45679,"MINERAL",7384,5817,4911,4349,3093,2049,1218,16,81,271,461,629,1189,1926]
["CA",156,"CA-156",45721,"MITCHELL CAVERN",2902,1993,1529,1252,708,343,130,1307,2066,2981,3612,4067,5347,6806]
["CA",157,"CA-157",45738,"MODESTO CITY-CO MOD",2358,1481,1062,821,384,150,41,834,1570,2516,3190,3681,5069,6660]
["CA",158,"CA-158",45756,"MOJAVE",2835,1902,1427,1144,591,252,79,1238,1976,2870,3489,3936,5208,6694]
["CA",159,"CA-159",45790,"MONTEBELLO",949,370,168,86,9,0,0,931,1837,3082,3976,4624,6373,8189]
["CA",160,"CA-160",45795,"MONTEREY        MRY",3080,1632,976,664,189,31,1,6,74,420,864,1277,2630,4296]
["CA",161,"CA-161",45866,"MORRO BAY FIRE  87Q",3344,1805,1074,715,189,27,0,8,50,307,671,1044,2343,4008]
["CA",162,"CA-162",45890,"MOUNTAIN PASS",4105,3060,2500,2162,1410,832,435,856,1494,2274,2808,3192,4250,5452]
["CA",163,"CA-163",45915,"MOUNT DIABLO JU",3245,2160,1597,1267,642,253,70,501,983,1682,2215,2619,3817,5253]
["CA",164,"CA-164",45933,"MOUNT HAMILTON",4521,3341,2688,2290,1447,840,405,364,747,1333,1773,2106,3089,4304]
["CA",165,"CA-165",45983,"MOUNT SHASTA    MHS",5991,4524,3742,3262,2195,1337,703,59,235,592,906,1155,1908,2830]
["CA",166,"CA-166",46006,"MT WILSON NO 2",3995,2933,2351,2002,1268,734,358,463,969,1669,2182,2564,3655,4945]
["CA",167,"CA-167",46074,"NAPA STATE HOSP",2689,1612,1117,846,364,120,26,128,529,1276,1880,2337,3680,5261]
["CA",168,"CA-168",46118,"NEEDLES AP      EED",1227,660,416,292,95,19,0,3451,4545,5803,6654,7260,8888,10636]
["CA",169,"CA-169",46136,"NEVADA CITY",4565,3321,2667,2270,1421,789,367,312,689,1271,1713,2046,3024,4216]
["CA",170,"CA-170",46144,"NEWARK (OAKLAND OAK",2367,1332,878,642,251,66,12,126,530,1320,1962,2458,3889,5530]
["CA",171,"CA-171",46154,"NEW CUYAMA FIRE",3321,2221,1662,1330,671,263,68,471,996,1720,2258,2654,3820,5237]
["CA",172,"CA-172",46168,"NEWMAN",2680,1749,1289,1022,505,212,64,747,1449,2345,2977,3439,4748,6280]
["CA",173,"CA-173",46175,"NEWPORT BEACH H",1715,729,368,211,32,0,0,155,543,1366,2101,2673,4320,6112]
["CA",174,"CA-174",46336,"OAKLAND MUSEUM",2400,1250,780,545,180,38,4,83,377,1052,1677,2172,3634,5316]
["CA",175,"CA-175",46377,"OCEANSIDE MARIN",2009,902,470,277,42,0,0,161,505,1222,1887,2425,4012,5796]
["CA",176,"CA-176",46399,"OJAI",2092,1137,715,499,154,30,0,426,989,1858,2531,3047,4526,6227]
["CA",177,"CA-177",46476,"ORANGE COVE",2538,1643,1204,947,463,192,57,1098,1857,2788,3444,3920,5261,6814]
["CA",178,"CA-178",46498,"ORICK PRAIRIE C",5005,3308,2416,1908,951,396,114,0,3,94,298,518,1390,2658]
["CA",179,"CA-179",46506,"ORLAND",2630,1699,1232,961,434,141,23,871,1581,2477,3102,3560,4859,6392]
["CA",180,"CA-180",46508,"ORLEANS",3389,2280,1722,1397,743,327,104,350,831,1549,2087,2492,3662,5071]
["CA",181,"CA-181",46521,"OROVILLE",2818,1837,1342,1059,505,193,49,770,1422,2264,2866,3313,4581,6099]
["CA",182,"CA-182",46569,"OXNARD (CAMARIL CMA",1935,881,481,294,56,0,0,82,404,1154,1852,2393,3981,5750]
["CA",183,"CA-183",46599,"PACIFICA 4 SSE",3247,1806,1143,813,277,54,0,3,72,419,853,1251,2538,4143]
["CA",184,"CA-184",46624,"PALMDALE (LANCA",2704,1795,1336,1065,540,226,69,1242,1998,2916,3551,4010,5311,6821]
["CA",185,"CA-185",46635,"PALM SPRINGS    PSP",951,472,281,189,53,11,0,3084,4224,5569,6475,7112,8800,10583]
["CA",186,"CA-186",46646,"PALO ALTO",2584,1479,988,725,291,84,15,93,452,1172,1776,2244,3636,5252]
["CA",187,"CA-187",46657,"PALOMAR MOUNTAI",4060,2960,2362,2002,1238,696,324,478,963,1638,2133,2504,3568,4850]
["CA",188,"CA-188",46685,"PARADISE",3145,2138,1615,1307,689,289,84,828,1464,2279,2854,3277,4483,5908]
["CA",189,"CA-189",46699,"PARKER RESERVOI",1230,671,431,308,109,25,3,3424,4523,5790,6644,7251,8877,10619]
["CA",190,"CA-190",46719,"PASADENA",1398,660,371,229,48,0,0,779,1558,2644,3450,4042,5683,7461]
["CA",191,"CA-191",46730,"PASO ROBLES",2932,1839,1315,1012,450,154,33,307,785,1519,2087,2517,3779,5307]
["CA",192,"CA-192",46742,"PASO ROBLES MUN PRB",2789,1754,1247,958,422,139,28,469,1038,1829,2418,2857,4150,5691]
["CA",193,"CA-193",46773,"PEARBLOSSOM",2908,1960,1480,1196,636,281,93,1086,1801,2679,3295,3739,5004,6474]
["CA",194,{"$f":"CONCATENATE(A196,\"-\",B196)","v":"CA-194"},46826,"PETALUMA FIRE S",2741,1611,1098,818,331,94,15,65,385,1082,1662,2114,3452,5039]
["CA",195,"CA-195",46926,"PINNACLES NATL",2907,1837,1315,1015,461,147,32,377,882,1637,2209,2641,3911,5422]
["CA",196,"CA-196",46943,"PISMO BEACH",2524,1263,746,504,136,25,0,21,151,708,1286,1773,3232,4945]
["CA",197,"CA-197",46960,"PLACERVILLE",3324,2241,1685,1357,692,275,70,610,1164,1907,2445,2846,4007,5414]
["CA",198,"CA-198",46962,"PLACERVILLE IFG",3235,2245,1715,1400,772,354,123,846,1470,2270,2835,3251,4449,5857]
["CA",199,"CA-199",47009,"POINT ARENA",4332,2629,1764,1289,516,143,24,0,4,95,324,580,1633,3084]
["CA",200,"CA-200",893111,"POINT MUGU NF",1960,907,503,311,61,0,0,77,399,1148,1839,2376,3952,5717]
["CA",201,"CA-201",47050,"POMONA FAIRPLEX",1718,893,545,370,98,17,0,531,1191,2170,2916,3472,5024,6766]
["CA",202,"CA-202",47077,"PORTERVILLE",2053,1248,864,654,291,103,28,1411,2246,3268,3980,4498,5963,7599]
["CA",203,"CA-203",47085,"PORTOLA",7303,5704,4835,4300,3103,2122,1339,19,106,330,556,752,1372,2166]
["CA",204,"CA-204",47109,"POTTER VALLEY P",3429,2274,1686,1339,654,236,54,300,745,1413,1921,2304,3444,4852]
["CA",205,"CA-205",47150,"PRIEST VALLEY",3946,2737,2103,1722,936,414,130,258,653,1269,1731,2078,3120,4422]
["CA",206,"CA-206",47195,"QUINCY",5490,4100,3369,2917,1933,1159,605,122,364,798,1162,1440,2274,3288]
["CA",207,"CA-207",47228,"RAMONA FIRE DEP",2192,1239,794,567,181,37,0,469,1036,1884,2532,3033,4474,6154]
["CA",208,"CA-208",47253,"RANDSBURG",3134,2192,1702,1410,809,403,162,1233,1965,2848,3454,3891,5116,6536]
["CA",209,"CA-209",47292,"RED BLUFF AP    RBL",2647,1721,1252,981,455,157,30,1192,1926,2827,3454,3912,5208,6736]
["CA",210,"CA-210",47304,"REDDING MUNICIP RDD",2961,1812,1324,1042,492,161,35,1095,1741,2665,3274,3723,4996,6491]
["CA",211,"CA-211",47306,"REDLANDS",1904,1070,697,502,170,40,0,961,1714,2705,3425,3962,5456,7149]
["CA",{"$f":"IF(A213=A214,B213+1,1)","v":212},"CA-212",47339,"REDWOOD CITY",2764,1624,1102,815,326,90,15,83,422,1105,1678,2123,3459,5049]
["CA",213,"CA-213",47404,"RICHARDSON GR S",3743,2510,1885,1515,781,325,96,158,500,1094,1562,1924,3014,4384]
["CA",214,"CA-214",47414,"RICHMOND",2720,1434,901,633,217,45,5,22,184,723,1284,1746,3154,4808]
["CA",215,"CA-215",47470,"RIVERSIDE FIRE",1475,721,418,267,60,6,0,1057,1863,2932,3725,4304,5921,7693]
["CA",216,"CA-216",47473,"RIVERSIDE CITRU",1674,883,554,385,111,23,0,924,1697,2734,3497,4058,5610,7346]
["CA",217,"CA-217",47630,"SACRAMENTO AP   SAC",2666,1646,1165,892,388,120,23,578,1248,2059,2675,3133,4453,6012]
["CA",218,"CA-218",47633,"SACRAMENTO 5 ES",2226,1365,956,729,324,114,27,850,1597,2559,3248,3751,5172,6784]
["CA",219,"CA-219",47641,"SAGEHEN CREEK",8741,6976,5987,5367,3985,2826,1883,0,6,66,174,282,718,1354]
["CA",220,"CA-220",47643,"SAINT HELENA",2652,1641,1157,886,389,121,22,285,806,1618,2231,2689,4019,5575]
["CA",221,"CA-221",47668,"SALINAS NO 2",2819,1489,914,631,192,36,0,8,131,594,1115,1561,2946,4614]
["CA",222,"CA-222",47669,"SALINAS AP      SNS",2755,1502,956,678,235,49,3,25,210,746,1293,1747,3126,4767]
["CA",223,"CA-223",47689,"SALT SPRINGS PW",3828,2694,2109,1758,1027,526,206,511,1015,1706,2216,2596,3690,5011]
["CA",224,"CA-224",47723,"SAN BERNARDINO",1599,831,512,352,95,16,0,1132,1937,2994,3772,4339,5908,7655]
["CA",225,"CA-225",47735,"SANDBERG        SDB",4146,3044,2447,2080,1300,734,343,575,1066,1735,2230,2596,3639,4899]
["CA",226,"CA-226",47740,"SAN DIEGO LINDB SAN",1063,328,116,51,4,0,0,255,866,1947,2832,3494,5273,7094]
["CA",227,"CA-227",893107,"SAN DIEGO MIRAM",1800,929,568,384,105,20,0,400,979,1912,2644,3192,4736,6478]
["CA",228,"CA-228",893112,"SAN DIEGO N ISL",1446,599,299,167,22,0,0,264,801,1774,2575,3170,4851,6654]
["CA",229,"CA-229",47767,"SAN FRANCISCO O",3653,2025,1229,824,219,31,0,0,17,192,491,814,2036,3673]
["CA",230,"CA-230",47769,"SAN FRANCISCO I SFO",2862,1467,883,591,157,23,2,31,142,581,1091,1529,2922,4612]
["CA",231,"CA-231",47772,"SAN FRANCISCO D",2589,1281,732,472,110,11,0,17,164,648,1200,1665,3131,4857]
["CA",232,"CA-232",47785,"SAN GABRIEL FIR",1295,577,307,182,32,0,0,782,1575,2681,3508,4110,5786,7580]
["CA",233,"CA-233",47807,"SAN GREGORIO 2",3629,2078,1325,930,317,60,5,0,32,270,611,947,2158,3729]
["CA",234,"CA-234",47813,"SAN JACINTO R S",1914,1086,714,518,180,42,3,1129,1903,2902,3624,4157,5645,7333]
["CA",235,"CA-235",47821,"SAN JOSE",2171,1231,806,583,217,52,9,257,811,1696,2365,2873,4332,5993]
["CA",236,"CA-236",47846,"SAN LUIS DAM",2625,1700,1250,989,494,215,72,790,1486,2387,3032,3500,4830,6376]
["CA",237,"CA-237",47851,"SAN LUIS OBISPO",2129,1106,677,463,130,24,0,111,476,1249,1918,2432,3926,5644]
["CA",238,"CA-238",47874,"SAN PASQUAL ANI",1725,884,530,354,87,8,0,620,1313,2298,3039,3590,5149,6895]
["CA",239,"CA-239",47880,"SAN RAFAEL CIVI",2621,1502,1001,732,286,80,14,97,451,1160,1753,2214,3592,5210]
["CA",240,"CA-240",47888,"SANTA ANA FIRE",1153,466,222,116,15,0,0,547,1299,2435,3289,3914,5637,7447]
["CA",241,"CA-241",47902,"SANTA BARBARA",1902,871,482,298,59,5,0,109,470,1262,1967,2517,4100,5872]
["CA",242,"CA-242",47905,"SANTA BARBARA M SBA",2121,1042,599,383,84,8,0,130,482,1228,1882,2394,3920,5670]
["CA",243,"CA-243",47916,"SANTA CRUZ",2836,1526,969,686,231,44,3,15,162,680,1217,1663,3035,4675]
["CA",244,"CA-244",47946,"SANTA MARIA AP  SMX",2783,1418,846,564,146,21,2,23,121,566,1090,1536,2942,4645]
["CA",245,"CA-245",47953,"SANTA MONICA PI",1803,759,382,206,31,0,0,93,429,1202,1921,2473,4124,5919]
["CA",246,"CA-246",47957,"SANTA PAULA",1904,938,548,360,86,10,0,185,602,1436,2142,2687,4237,5986]
["CA",247,"CA-247",47965,"SANTA ROSA",2694,1552,1037,760,293,78,13,160,526,1205,1789,2240,3599,5210]
["CA",248,"CA-248",48045,"SCOTIA",3793,2287,1564,1178,512,155,32,0,47,329,700,1042,2202,3673]
["CA",249,"CA-249",48135,"SHASTA DAM",2894,1943,1454,1167,595,237,61,1169,1884,2755,3363,3807,5059,6525]
["CA",250,"CA-250",48163,"SHELTER COVE AV",3266,1802,1098,750,224,38,0,11,92,412,804,1187,2484,4125]
["CA",251,"CA-251",48207,"SIERRA CITY",5183,3874,3180,2758,1827,1090,574,182,492,1008,1408,1712,2582,3613]
["CA",252,"CA-252",48218,"SIERRAVILLE R S",6884,5333,4511,4004,2882,1956,1221,18,119,395,666,890,1584,2443]
["CA",253,"CA-253",48351,"SONOMA",2647,1599,1105,834,349,108,22,234,717,1492,2094,2549,3892,5476]
["CA",254,"CA-254",48353,"SONORA RS",3618,2505,1922,1571,844,358,101,509,1030,1744,2256,2635,3733,5073]
["CA",255,"CA-255",48380,"SOUTH ENTR YOSE",6513,5034,4208,3701,2572,1641,927,23,131,408,678,898,1574,2398]
["CA",256,"CA-256",48558,"STOCKTON AP     SCK",2563,1617,1152,891,400,130,29,770,1456,2331,2961,3428,4761,6318]
["CA",257,"CA-257",48560,"STOCKTON FIRE S",2686,1718,1253,988,482,197,55,575,1203,2062,2690,3157,4476,6016]
["CA",258,{"$f":"CONCATENATE(A260,\"-\",B260)","v":"CA-258"},48587,"STONY GORGE RES",3268,2235,1695,1370,708,283,71,755,1376,2166,2722,3128,4292,5690]
["CA",259,"CA-259",48606,"STRAWBERRY VALL",5298,3962,3233,2794,1828,1075,555,84,312,746,1111,1396,2236,3250]
["CA",260,"CA-260",48655,"SUN CITY",2123,1247,833,610,227,57,7,982,1710,2658,3337,3847,5290,6941]
["CA",261,"CA-261",48702,"SUSANVILLE 2 SW",6168,4766,4012,3547,2528,1694,1057,149,390,813,1154,1418,2202,3141]
["CA",262,"CA-262",48758,"TAHOE CITY",7616,6029,5124,4563,3306,2241,1375,4,47,215,404,573,1130,1855]
["CA",263,"CA-263",48762,"TAHOE VALLEY AP TVL",8300,6600,5652,5059,3730,2617,1718,6,38,162,309,443,926,1595]
["CA",264,"CA-264",48826,"TEHACHAPI",4301,3076,2436,2044,1208,616,251,277,677,1280,1733,2071,3061,4294]
["CA",265,"CA-265",48839,"TEJON RANCHO",2555,1650,1200,941,450,173,45,1209,1960,2879,3525,3994,5328,6877]
["CA",266,"CA-266",48873,"TERMO 1 E",7734,6134,5257,4710,3473,2462,1643,32,134,359,578,761,1346,2097]
["CA",267,"CA-267",48892,"THERMAL RGNL AP TRM",1141,594,365,251,71,14,0,2823,3916,5194,6059,6674,8321,10089]
["CA",268,"CA-268",48917,"THREE RIVERS ED",2615,1690,1227,955,442,158,35,1238,1983,2883,3514,3972,5284,6826]
["CA",269,"CA-269",48928,"TIGER CREEK PH",4058,2894,2283,1914,1130,561,219,337,788,1449,1935,2293,3332,4576]
["CA",270,"CA-270",48973,"TORRANCE",1526,649,330,186,28,0,0,240,742,1692,2468,3054,4720,6517]
["CA",271,"CA-271",48999,"TRACY CARBONA",2880,1884,1391,1108,553,230,70,462,1056,1885,2486,2933,4203,5706]
["CA",272,"CA-272",49001,"TRACY PUMPING P",2421,1523,1090,840,387,146,38,754,1470,2399,3060,3542,4911,6496]
["CA",273,"CA-273",49026,"TRINITY RIVER H",4527,3292,2643,2245,1387,733,307,256,641,1231,1677,2010,2975,4124]
["CA",274,"CA-274",49035,"TRONA",2492,1683,1279,1040,570,273,103,2058,2922,3937,4625,5117,6471,7998]
["CA",275,"CA-275",49043,"TRUCKEE RS",7591,5983,5105,4564,3346,2317,1482,19,100,317,535,723,1321,2080]
["CA",{"$f":"IF(A277=A278,B277+1,1)","v":276},"CA-276",49053,"TULELAKE",7003,5458,4632,4119,2989,2050,1317,31,154,436,703,921,1594,2433]
["CA",277,"CA-277",49073,"TURLOCK #2",2519,1609,1168,912,441,184,58,789,1506,2421,3074,3548,4901,6471]
["CA",278,"CA-278",49087,"TUSTIN IRVINE R",1794,920,568,390,115,23,0,489,1102,2052,2797,3348,4898,6630]
["CA",279,"CA-279",49099,"TWENTYNINE PALM",1910,1166,801,602,255,77,15,2148,3064,4142,4877,5406,6882,8530]
["CA",280,"CA-280",49105,"TWIN LAKES",8874,7228,6260,5644,4251,3052,2051,0,25,122,248,363,771,1346]
["CA",281,"CA-281",49111,"TWITCHELL DAM",2199,1150,699,476,134,24,0,122,487,1228,1874,2381,3864,5578]
["CA",282,"CA-282",49122,"UKIAH           UKI",3083,1993,1444,1127,507,159,28,340,843,1577,2123,2534,3743,5218]
["CA",283,"CA-283",49152,"U C L A",1364,590,299,170,30,0,0,319,893,1922,2726,3326,5013,6808]
["CA",284,"CA-284",49185,"UPPER SAN LEAND",2810,1582,1047,761,288,70,9,36,261,856,1413,1861,3210,4817]
["CA",285,"CA-285",49200,"VACAVILLE",2410,1507,1067,818,360,122,26,777,1498,2420,3075,3556,4925,6510]
["CA",286,"CA-286",49325,"VICTORVILLE PUM",2929,1969,1481,1189,613,263,83,1032,1735,2599,3204,3645,4895,6368]
["CA",287,"CA-287",49367,"VISALIA",2588,1688,1240,982,492,215,71,942,1685,2612,3258,3731,5065,6612]
["CA",288,"CA-288",49378,"VISTA 2 NNE",1514,676,368,221,40,0,0,439,1047,2040,2827,3410,5053,6840]
["CA",289,"CA-289",49440,"WARM SPRINGS DA",2962,1884,1357,1062,486,164,31,174,624,1372,1942,2372,3623,5126]
["CA",290,"CA-290",49452,"WASCO",2434,1570,1142,893,435,183,57,1196,1990,2949,3616,4099,5465,7039]
["CA",291,"CA-291",49473,"WATSONVILLE WAT WVI",3083,1698,1095,786,280,62,5,10,123,565,1055,1476,2798,4402]
["CA",292,"CA-292",49490,"WEAVERVILLE",4721,3473,2810,2408,1522,839,375,287,664,1241,1673,1999,2936,4053]
["CA",293,"CA-293",49499,"WEED FIRE DEPT",6023,4568,3789,3308,2243,1382,742,80,271,642,958,1208,1964,2892]
["CA",294,"CA-294",49621,"WHISKEYTOWN RES",3240,2240,1717,1405,771,352,115,968,1628,2451,3023,3444,4635,6041]
["CA",295,"CA-295",49671,"WILDROSE R S",3663,2641,2096,1771,1065,559,243,964,1623,2427,2976,3383,4498,5818]
["CA",296,"CA-296",49684,"WILLITS 1 NE",4302,2887,2183,1769,935,392,109,32,193,604,997,1311,2300,3582]
["CA",297,"CA-297",49694,"WILLOW CREEK 1",3566,2436,1858,1515,814,353,107,408,887,1582,2097,2486,3611,4973]
["CA",298,"CA-298",49699,"WILLOWS 6 W",2874,1897,1403,1112,541,200,45,702,1358,2207,2805,3247,4499,5984]
["CA",299,"CA-299",49742,"WINTERS",2527,1633,1192,936,442,166,40,891,1640,2572,3225,3698,5031,6579]
["CA",300,"CA-300",49775,"WOODFORDS",6059,4650,3896,3426,2383,1525,871,124,356,770,1110,1374,2142,3057]
["CA",301,"CA-301",49781,"WOODLAND 1 WNW",2683,1757,1297,1030,509,206,56,720,1417,2316,2951,3414,4719,6240]
["CA",302,"CA-302",49792,"WOODSIDE FIRE S",2769,1669,1154,866,357,105,19,159,569,1293,1872,2315,3632,5204]
["CA",303,"CA-303",49855,"YOSEMITE PARK H",4759,3545,2903,2506,1642,959,488,400,828,1440,1891,2226,3170,4275]
["CA",304,"CA-304",49866,"YREKA SISKIYOU  SIY",5550,4217,3505,3064,2084,1297,711,235,550,1039,1422,1711,2552,3552]
["ID",1,{"$f":"CONCATENATE(A307,\"-\",B307)","v":"ID-1"},100010,"ABERDEEN EXPERI",7817,6319,5504,4993,3854,2894,2117,78,256,585,864,1083,1743,2556]
["ID",{"$f":"IF(A307=A308,B307+1,1)","v":2},{"$f":"CONCATENATE(A308,\"-\",B308)","v":"ID-2"},100227,"AMERICAN FALLS",6773,5407,4669,4210,3185,2333,1637,210,501,961,1317,1585,2362,3279]
["ID",3,{"$f":"CONCATENATE(A309,\"-\",B309)","v":"ID-3"},100282,"ANDERSON DAM",6724,5363,4622,4162,3125,2253,1539,267,571,1034,1388,1658,2434,3346]
["ID",4,{"$f":"CONCATENATE(A310,\"-\",B310)","v":"ID-4"},100347,"ARBON 2 NW",7816,6324,5506,4993,3839,2867,2071,89,273,605,883,1099,1756,2567]
["ID",5,{"$f":"CONCATENATE(A311,\"-\",B311)","v":"ID-5"},100375,"ARCO",8482,6961,6132,5611,4439,3443,2615,89,262,566,832,1040,1679,2474]
["ID",6,"ID-6",100448,"ARROWROCK DAM",6228,4899,4175,3726,2732,1919,1274,361,708,1204,1577,1857,2669,3630]
["ID",7,"ID-7",100470,"ASHTON",8611,7033,6172,5634,4415,3373,2490,36,153,400,633,825,1424,2182]
["ID",8,"ID-8",100528,"AVERY RS #2",7150,5684,4891,4391,3270,2335,1582,141,355,715,1014,1245,1941,2791]
["ID",9,"ID-9",100667,"BAYVIEW MODEL B",7370,5808,4953,4419,3197,2172,1363,48,181,442,682,878,1480,2247]
["ID",10,"ID-10",100915,"BLACKFOOT 1 SE",7498,6024,5222,4725,3628,2723,1984,95,288,640,933,1166,1873,2738]
["ID",11,"ID-11",101002,"BLISS 4 NW",6300,4973,4255,3814,2835,2030,1396,277,613,1114,1490,1773,2585,3542]
["ID",12,"ID-12",101017,"BOISE 7 N",6325,4971,4233,3773,2754,1921,1268,326,648,1117,1473,1741,2527,3460]
["ID",13,"ID-13",101018,"BOISE LUCKY PEA",5730,4428,3738,3318,2405,1672,1121,378,743,1267,1667,1967,2840,3861]
["ID",14,"ID-14",101022,"BOISE AIR TERMI BOI",5727,4501,3804,3370,2394,1589,981,386,807,1315,1715,2009,2856,3880]
["ID",15,"ID-15",101079,"BONNERS FERRY",6890,5423,4628,4133,3021,2119,1409,93,287,645,947,1181,1890,2766]
["ID",16,"ID-16",101180,"BROWNLEE DAM",5283,4092,3456,3063,2200,1500,958,745,1232,1867,2327,2664,3604,4677]
["ID",17,"ID-17",101195,"BRUNEAU",5377,4125,3456,3052,2176,1482,968,439,852,1426,1854,2171,3086,4156]
["ID",18,"ID-18",101220,"BUHL NO 2",6728,5339,4581,4111,3071,2208,1512,251,526,962,1299,1558,2320,3230]
["ID",19,"ID-19",101303,"BURLEY MUNICIPA BYI",6210,4867,4143,3702,2732,1939,1320,285,608,1090,1462,1745,2564,3529]
["ID",20,"ID-20",101363,"CABINET GORGE",7368,5828,4990,4463,3283,2302,1531,56,204,489,747,952,1588,2402]
["ID",21,"ID-21",101380,"CALDWELL",5606,4352,3683,3280,2393,1686,1158,490,911,1481,1904,2220,3119,4171]
["ID",22,"ID-22",101408,"CAMBRIDGE",6726,5380,4650,4200,3208,2409,1760,320,646,1124,1489,1764,2575,3541]
["ID",{"$f":"IF(A328=A329,B328+1,1)","v":23},"ID-23",101514,"CASCADE 1 NW",9224,7576,6646,6060,4717,3548,2582,25,100,276,443,587,1064,1701]
["ID",24,"ID-24",101551,"CASTLEFORD 2 N",6326,4963,4232,3781,2797,1986,1348,196,481,940,1305,1584,2394,3349]
["ID",25,"ID-25",101663,"CHALLIS",7535,6085,5291,4796,3678,2748,1981,143,362,737,1036,1271,1975,2829]
["ID",26,"ID-26",101671,"CHILLY BARTON F",9219,7593,6692,6130,4839,3723,2782,19,99,298,493,659,1186,1875]
["ID",27,"ID-27",101932,"COBALT",8837,7209,6311,5752,4477,3380,2462,20,100,294,493,662,1209,1919]
["ID",28,"ID-28",101956,"COEUR D'ALENE",6540,5114,4333,3848,2768,1901,1221,185,426,826,1141,1386,2124,3030]
["ID",29,"ID-29",102159,"COTTONWOOD 2 WS",7098,5597,4775,4261,3107,2154,1396,129,322,642,917,1134,1791,2610]
["ID",30,"ID-30",102187,"COUNCIL",6525,5189,4468,4021,3030,2218,1565,379,719,1208,1579,1859,2668,3624]
["ID",31,"ID-31",102260,"CRATERS OF THE",8241,6776,5968,5458,4293,3283,2424,161,378,740,1025,1244,1893,2671]
["ID",32,"ID-32",102444,"DEER FLAT DAM",5205,3964,3325,2943,2101,1457,987,380,790,1377,1819,2151,3100,4209]
["ID",33,"ID-33",102575,"DIXIE",10582,8817,7810,7165,5665,4352,3227,0,14,74,164,247,572,1066]
["ID",34,"ID-34",102676,"DRIGGS",9179,7543,6638,6071,4772,3654,2705,17,90,281,470,632,1154,1833]
["ID",35,"ID-35",102707,"DUBOIS EXPERIME",8437,6949,6127,5611,4434,3418,2547,126,325,662,936,1148,1787,2564]
["ID",36,"ID-36",102845,"DWORSHAK FISH H",5434,4140,3444,3015,2081,1342,804,330,694,1225,1624,1925,2802,3843]
["ID",37,"ID-37",102875,"ELK CITY 1 NE",8620,6955,6024,5442,4119,3001,2096,11,62,222,387,535,1034,1710]
["ID",38,"ID-38",102892,"ELK RIVER 1 S",7885,6277,5391,4837,3584,2530,1694,34,137,356,564,742,1310,2056]
["ID",39,"ID-39",102942,"EMMETT 2 E",5646,4354,3667,3252,2348,1631,1099,414,792,1326,1729,2034,2916,3954]
["ID",40,"ID-40",103108,"FAIRFIELD RANGE",8471,6949,6117,5593,4416,3416,2568,87,255,558,818,1026,1662,2451]
["ID",41,"ID-41",103143,"FENN RANGER STN P69",5982,4619,3881,3421,2401,1584,963,206,499,961,1318,1591,2389,3359]
["ID",42,"ID-42",103297,"FORT HALL 1 NNE",7756,6256,5438,4931,3785,2831,2048,67,239,565,843,1062,1724,2537]
["ID",43,"ID-43",103448,"GARDEN VALLEY",7083,5612,4818,4318,3209,2285,1546,124,325,681,979,1211,1923,2797]
["ID",44,"ID-44",103554,"GIBBONSVILLE",8766,7162,6278,5723,4452,3358,2451,29,129,350,560,738,1289,2002]
["ID",45,"ID-45",103631,"GLENNS FERRY",5837,4533,3827,3397,2455,1696,1123,370,734,1252,1644,1938,2782,3784]
["ID",46,"ID-46",103732,"GRACE",8046,6519,5689,5168,3998,3012,2208,67,224,523,788,995,1638,2438]
["ID",47,"ID-47",103760,"GRAND VIEW 4 NW",5709,4423,3732,3312,2403,1668,1115,363,740,1280,1684,1990,2868,3901]
["ID",48,"ID-48",103771,"GRANGEVILLE",6508,5029,4228,3727,2631,1748,1083,121,318,666,958,1188,1898,2783]
["ID",49,"ID-49",103882,"GROUSE",10344,8648,7690,7084,5699,4497,3481,5,42,170,307,432,865,1467]
["ID",50,"ID-50",103932,"HAGERMAN 2 SW",5608,4335,3655,3243,2342,1616,1064,358,748,1300,1714,2025,2917,3961]
["ID",51,"ID-51",103964,"HAMER 4 NW",8460,6979,6172,5666,4515,3526,2703,94,286,630,916,1135,1798,2597]
["ID",52,"ID-52",104140,"HAZELTON",6666,5290,4541,4074,3037,2183,1498,237,530,981,1326,1589,2352,3267]
["ID",53,"ID-53",104150,"HEADQUARTERS",7964,6356,5466,4908,3636,2561,1704,29,126,343,548,720,1268,1984]
["ID",54,"ID-54",104268,"HILL CITY 1 W",8662,7088,6227,5685,4460,3427,2564,53,185,435,669,855,1444,2201]
["ID",55,"ID-55",104295,"HOLLISTER",6565,5168,4409,3934,2885,2019,1335,195,466,894,1230,1487,2239,3139]
["ID",56,"ID-56",104384,"HOWE",8105,6640,5834,5329,4193,3230,2441,121,327,685,974,1199,1871,2694]
["ID",57,"ID-57",104442,"IDAHO CITY",7995,6432,5576,5039,3817,2788,1946,65,207,469,708,902,1502,2268]
["ID",58,"ID-58",104455,"IDAHO FALLS 2 E",7604,6170,5386,4896,3796,2866,2104,143,373,766,1076,1316,2022,2871]
["ID",59,"ID-59",104456,"IDAHO FALLS 16",9464,7805,6870,6282,4933,3762,2780,21,85,252,414,551,1018,1638]
["ID",60,"ID-60",104457,"IDAHO FALLS FAN IDA",7917,6458,5657,5158,4028,3077,2299,114,322,688,983,1210,1892,2722]
["ID",61,"ID-61",104460,"IDAHO FALLS 46",8673,7171,6341,5820,4630,3608,2756,109,296,621,885,1094,1711,2473]
["ID",62,"ID-62",104598,"ISLAND PARK",10024,8353,7414,6823,5463,4268,3239,10,60,214,370,508,969,1579]
["ID",63,"ID-63",104670,"JEROME",6483,5142,4414,3965,2959,2133,1468,321,651,1136,1504,1778,2571,3506]
["ID",64,"ID-64",104831,"KELLOGG",6951,5457,4645,4134,2987,2053,1323,106,296,629,910,1132,1802,2644]
["ID",65,"ID-65",104845,"KETCHUM RANGER",9398,7745,6815,6230,4892,3742,2776,23,97,268,432,579,1056,1708]
["ID",66,"ID-66",105013,"KOOSKIA 5 SSE",6416,4993,4220,3740,2684,1836,1184,164,403,804,1125,1377,2132,3058]
["ID",67,"ID-67",105038,"KUNA",5752,4423,3714,3285,2368,1646,1115,259,579,1075,1460,1755,2623,3666]
["ID",68,"ID-68",105177,"LEADORE NO 2",9546,7892,6973,6398,5080,3948,2991,11,69,243,418,574,1077,1743]
["ID",69,{"$f":"CONCATENATE(A375,\"-\",B375)","v":"ID-69"},105241,"LEWISTON AP     LWS",5220,3935,3248,2819,1877,1136,630,398,792,1338,1747,2048,2931,4017]
["ID",70,"ID-70",105275,"LIFTON PUMPING",9010,7438,6579,6038,4803,3732,2822,42,167,422,658,844,1422,2146]
["ID",71,"ID-71",105414,"LOWMAN",7840,6262,5403,4868,3663,2662,1845,36,151,398,634,829,1449,2253]
["ID",72,"ID-72",105462,"MACKAY LOST RIV",8611,7061,6217,5688,4488,3456,2580,57,199,475,725,926,1540,2306]
["ID",73,"ID-73",105559,"MALAD CITY AP",7825,6345,5530,5024,3886,2927,2148,102,296,641,923,1143,1809,2624]
["ID",74,"ID-74",105563,"MALTA 4 ESE",6910,5469,4685,4196,3122,2238,1537,134,355,740,1050,1293,2019,2905]
["ID",75,"ID-75",105678,"MASSACRE ROCKS",6881,5514,4770,4304,3272,2404,1696,239,539,999,1349,1614,2380,3286]
["ID",76,"ID-76",105685,"MAY 2 SSE",8574,7015,6161,5625,4401,3353,2481,53,188,452,695,889,1486,2238]
["ID",77,"ID-77",105708,"MCCALL          MYL",8888,7231,6301,5717,4379,3233,2280,20,87,256,421,566,1048,1700]
["ID",78,"ID-78",105716,"MCCAMMON",7461,5995,5196,4697,3583,2655,1896,110,311,670,966,1199,1898,2750]
["ID",79,"ID-79",105897,"MIDDLE FORK LOD",7764,6224,5382,4855,3662,2652,1841,66,219,504,759,961,1592,2389]
["ID",80,"ID-80",105980,"MINIDOKA DAM",6715,5354,4615,4159,3140,2296,1607,235,534,1000,1357,1626,2409,3329]
["ID",81,"ID-81",106053,"MONTPELIER RANG",8727,7192,6345,5808,4575,3510,2615,64,220,510,758,950,1536,2267]
["ID",82,"ID-82",106152,"MOSCOW U OF I",6706,5210,4404,3906,2819,1944,1277,81,254,584,873,1103,1814,2700]
["ID",83,"ID-83",106174,"MOUNTAIN HOME",6084,4778,4072,3632,2661,1865,1244,433,812,1331,1718,2006,2831,3796]
["ID",84,"ID-84",106305,"NAMPA SUGAR FAC",5873,4567,3859,3431,2500,1744,1177,332,692,1209,1599,1893,2744,3752]
["ID",85,"ID-85",106388,"NEW MEADOWS RAN",8894,7270,6366,5800,4502,3394,2492,24,109,309,503,667,1190,1877]
["ID",86,"ID-86",106424,"NEZPERCE",7223,5661,4807,4274,3090,2131,1383,54,191,454,696,894,1519,2330]
["ID",{"$f":"IF(A392=A393,B392+1,1)","v":87},"ID-87",106542,"OAKLEY",6706,5285,4509,4029,2967,2093,1397,145,380,779,1101,1351,2091,2985]
["ID",88,"ID-88",106590,"OLA 4 S",6904,5499,4729,4249,3193,2331,1645,201,463,884,1208,1457,2202,3105]
["ID",89,"ID-89",106681,"OROFINO",5712,4384,3668,3230,2263,1496,929,271,600,1098,1476,1766,2607,3614]
["ID",90,"ID-90",106764,"PALISADES",7509,6060,5267,4775,3659,2709,1924,124,339,715,1018,1253,1955,2802]
["ID",91,"ID-91",106844,"PARMA EXPERIMEN",6120,4796,4088,3651,2701,1928,1343,308,645,1145,1525,1813,2645,3631]
["ID",92,"ID-92",106877,"PAUL 1 ENE",6740,5344,4583,4109,3066,2207,1524,205,473,903,1238,1494,2246,3152]
["ID",93,"ID-93",106891,"PAYETTE",5603,4348,3686,3288,2414,1722,1202,421,831,1401,1829,2147,3056,4120]
["ID",94,"ID-94",107040,"PICABO",8542,6999,6150,5616,4398,3347,2486,72,228,511,756,951,1546,2284]
["ID",95,"ID-95",107046,"PIERCE",8212,6583,5679,5118,3835,2739,1858,25,109,304,495,663,1202,1914]
["ID",96,"ID-96",107211,"POCATELLO RGNL  PIH",7109,5702,4940,4462,3364,2422,1647,122,387,822,1156,1406,2133,3019]
["ID",97,"ID-97",107264,"PORTHILL",7290,5782,4961,4447,3283,2329,1590,84,258,575,851,1066,1721,2550]
["ID",98,"ID-98",107301,"POTLATCH 3 NNE",7223,5614,4734,4192,3017,2066,1364,24,112,327,542,728,1335,2143]
["ID",99,"ID-99",107320,"POWELL",8350,6732,5829,5264,3974,2869,1968,34,132,338,531,695,1229,1932]
["ID",100,"ID-100",107346,"PRESTON",7480,6065,5292,4808,3715,2795,2037,124,362,770,1093,1338,2055,2917]
["ID",101,"ID-101",107386,"PRIEST RIVER EX",7961,6377,5511,4972,3742,2693,1845,32,141,382,611,801,1395,2147]
["ID",102,"ID-102",107644,"REXBURG RICKS C",8325,6808,5981,5461,4283,3275,2432,69,236,544,813,1020,1656,2440]
["ID",103,"ID-103",107648,"REYNOLDS",6749,5308,4519,4025,2923,2019,1303,179,410,794,1099,1336,2045,2910]
["ID",104,"ID-104",107673,"RICHFIELD",7521,6075,5280,4787,3673,2735,1975,155,382,759,1062,1296,1990,2830]
["ID",105,"ID-105",107706,"RIGGINS",5120,3860,3192,2787,1904,1207,701,471,869,1434,1861,2185,3109,4191]
["ID",106,"ID-106",107968,"RUPERT 3 WSW",7193,5733,4938,4443,3343,2437,1708,112,319,683,983,1216,1919,2778]
["ID",107,"ID-107",108022,"SAINT ANTHONY 1",8909,7317,6441,5891,4647,3586,2691,45,162,395,613,795,1366,2097]
["ID",108,"ID-108",108062,"SAINT MARIES 1",6870,5381,4570,4063,2934,2018,1305,141,341,677,961,1185,1868,2723]
["ID",109,"ID-109",108080,"SALMON KSRA",7776,6323,5530,5035,3916,2973,2206,128,344,717,1017,1252,1956,2808]
["ID",110,"ID-110",108137,"SANDPOINT EXP S",7422,5873,5031,4507,3325,2352,1587,48,185,462,717,922,1560,2376]
["ID",111,"ID-111",108380,"SHOSHONE 1 WNW",6610,5298,4583,4141,3140,2307,1630,380,751,1265,1643,1923,2723,3653]
["ID",112,"ID-112",108395,"SHOUP",7034,5639,4879,4405,3333,2434,1716,241,511,943,1279,1535,2285,3187]
["ID",113,"ID-113",108412,"SILVER CITY 5 W",7349,5879,5071,4559,3394,2406,1590,190,414,770,1056,1271,1917,2701]
["ID",114,"ID-114",108535,"SODA SPRINGS AP",9045,7449,6565,6008,4731,3634,2712,38,149,378,589,764,1306,2005]
["ID",115,"ID-115",108676,"STANLEY",10870,9107,8105,7462,5990,4711,3632,0,11,74,165,254,602,1130]
["ID",116,"ID-116",108928,"SWAN FALLS P H",5022,3861,3243,2865,2049,1391,902,709,1214,1881,2358,2707,3682,4795]
["ID",117,"ID-117",108937,"SWAN VALLEY 2 E",8341,6783,5930,5391,4175,3134,2274,62,206,474,714,908,1503,2258]
["ID",118,"ID-118",109000,"TAYLOR RANCH",8250,6690,5835,5300,4080,3032,2172,64,206,469,712,905,1505,2265]
["ID",119,"ID-119",109065,"TETONIA EXPERIM",9821,8162,7238,6656,5325,4174,3188,11,71,236,404,553,1036,1675]
["ID",120,"ID-120",109293,"TWIN FALLS KMVT",6300,4950,4220,3765,2769,1954,1313,268,587,1061,1426,1703,2504,3454]
["ID",121,"ID-121",109303,"TWIN FALLS 6 E  TWF",6715,5292,4516,4035,2980,2117,1438,134,364,763,1085,1335,2079,2982]
["ID",122,"ID-122",109498,"WALLACE WOODLAN",7596,6023,5157,4618,3399,2395,1597,53,182,433,664,854,1452,2221]
["ID",123,"ID-123",109560,"WARREN",10258,8478,7456,6798,5257,3925,2812,0,10,58,129,201,486,960]
["ID",124,"ID-124",109638,"WEISER",5670,4430,3771,3366,2491,1786,1244,476,905,1487,1917,2237,3147,4205]
["ID",125,"ID-125",109846,"WINCHESTER",7976,6335,5418,4844,3558,2505,1681,27,104,290,467,624,1143,1851]
["ID",126,"ID-126",109951,"YELLOW PINE 7 S",9549,7830,6856,6236,4821,3605,2596,3,32,135,256,368,774,1356]
["UT",1,{"$f":"CONCATENATE(A433,\"-\",B433)","v":"UT-1"},420050,"ALLEN'S RANCH",6752,5393,4650,4186,3140,2262,1544,176,479,946,1298,1564,2337,3251]
["UT",{"$f":"IF(A433=A434,B433+1,1)","v":2},"UT-2",420061,"ALPINE",6163,4873,4169,3733,2760,1948,1298,291,666,1199,1590,1884,2720,3689]
["UT",3,"UT-3",420072,"ALTA",9688,8075,7126,6530,5151,3918,2841,0,28,152,298,430,867,1429]
["UT",4,"UT-4",420074,"ALTAMONT",8070,6588,5781,5275,4125,3144,2325,63,243,587,875,1098,1767,2579]
["UT",5,"UT-5",420086,"ALTON",7086,5598,4802,4312,3209,2272,1502,41,190,525,825,1063,1772,2616]
["UT",6,"UT-6",420157,"ANETH PLANT",4734,3647,3064,2709,1928,1303,834,869,1464,2200,2713,3083,4106,5258]
["UT",7,"UT-7",420168,"ANGLE",7763,6232,5405,4884,3705,2700,1876,16,131,425,691,902,1539,2326]
["UT",8,"UT-8",420336,"ARCHES NP HQS",4717,3664,3108,2760,1987,1363,886,1069,1706,2477,3006,3383,4415,5569]
["UT",9,"UT-9",420519,"BEAVER",6476,5113,4373,3911,2864,1981,1258,127,405,868,1224,1493,2264,3169]
["UT",10,"UT-10",420688,"BIG WATER",4166,3142,2593,2253,1510,918,502,1012,1673,2474,3020,3409,4477,5676]
["UT",11,"UT-11",420716,"BIRDSEYE",7802,6280,5448,4927,3746,2751,1945,32,171,474,737,947,1584,2381]
["UT",12,"UT-12",420730,"BLACK ROCK",6288,4963,4245,3804,2818,2008,1370,201,532,1032,1409,1692,2507,3470]
["UT",13,"UT-13",420738,"BLANDING",5482,4283,3631,3225,2309,1553,957,443,921,1546,1991,2315,3218,4246]
["UT",14,"UT-14",420757,"BLOWHARD MTN RA",9924,8258,7273,6649,5239,4010,2937,0,9,73,180,286,680,1226]
["UT",15,"UT-15",420788,"BLUFF",5252,4079,3443,3048,2174,1460,926,562,1059,1709,2169,2504,3439,4515]
["UT",16,"UT-16",420820,"BOUNTIFUL-VAL V",5937,4678,3993,3568,2614,1822,1183,441,861,1427,1836,2140,2996,3981]
["UT",17,"UT-17",420849,"BOULDER",6030,4740,4043,3609,2628,1818,1159,194,539,1077,1471,1768,2604,3566]
["UT",18,"UT-18",420928,"BRIGHAM CITY WA",6331,5027,4318,3884,2908,2101,1453,284,649,1172,1558,1847,2674,3640]
["UT",19,"UT-19",421008,"BRYCE CANYON NA",8910,7256,6358,5799,4523,3410,2455,2,39,209,406,577,1114,1794]
["UT",20,"UT-20",421020,"BULLFROG BASIN",4117,3127,2593,2265,1550,976,568,1326,2031,2866,3429,3829,4919,6132]
["UT",21,"UT-21",421144,"CALLAO",6167,4867,4158,3719,2747,1948,1312,299,670,1194,1581,1871,2704,3681]
["UT",22,"UT-22",421163,"CANYONLANDS THE",5653,4490,3857,3463,2570,1812,1194,624,1143,1806,2269,2603,3520,4548]
["UT",23,"UT-23",421168,"CANYONLANDS THE",5696,4514,3876,3480,2595,1848,1252,581,1073,1718,2174,2501,3416,4442]
["UT",24,"UT-24",421171,"CAPITOL REEF NA",5604,4446,3820,3428,2550,1807,1204,516,1028,1697,2165,2503,3432,4467]
["UT",25,"UT-25",421214,"CASTLE DALE",6748,5390,4654,4196,3174,2310,1614,145,429,897,1256,1527,2313,3234]
["UT",26,"UT-26",421241,"CASTLE VALLEY I",5313,4165,3546,3171,2319,1621,1078,638,1174,1851,2326,2671,3625,4701]
["UT",27,"UT-27",421267,"CEDAR CITY AP   CDC",5978,4703,4005,3567,2590,1774,1131,301,704,1253,1649,1941,2767,3726]
["UT",28,"UT-28",421308,"CEDAR POINT",7038,5646,4886,4413,3332,2405,1647,104,359,792,1127,1382,2118,2987]
["UT",29,"UT-29",421432,"CIRCLEVILLE",6754,5356,4593,4114,3032,2118,1377,87,328,755,1087,1339,2075,2948]
["UT",30,"UT-30",421588,"COALVILLE",7635,6096,5263,4743,3581,2613,1830,41,178,465,725,939,1596,2420]
["UT",31,"UT-31",421590,"COALVILLE 13 E",8369,6760,5889,5343,4108,3052,2176,10,83,300,523,705,1288,2032]
["UT",32,"UT-32",421731,"CORINNE",6559,5249,4543,4103,3112,2288,1623,316,676,1191,1572,1855,2665,3606]
["UT",33,"UT-33",421759,"COTTONWOOD WEIR",5441,4271,3639,3244,2368,1639,1060,685,1197,1853,2313,2647,3571,4613]
["UT",34,"UT-34",421918,"CUTLER DAM UTAH",6395,5112,4418,3986,3033,2232,1582,398,787,1331,1729,2026,2869,3840]
["UT",35,"UT-35",422057,"DEER CREEK DAM",7866,6339,5509,4989,3824,2854,2064,30,163,461,725,937,1585,2393]
["UT",36,"UT-36",422090,"DELTA",6198,4929,4242,3816,2865,2075,1442,394,809,1366,1770,2068,2913,3891]
["UT",37,"UT-37",422101,"DESERET",6238,4959,4262,3834,2875,2079,1442,390,799,1347,1746,2040,2879,3856]
["UT",38,"UT-38",422150,"DEWEY",5264,4150,3555,3185,2372,1716,1215,741,1289,1980,2468,2820,3795,4898]
["UT",39,"UT-39",422173,"DINOSAUR NM QUA",7111,5825,5135,4703,3720,2892,2210,311,702,1240,1629,1919,2735,3677]
["UT",40,"UT-40",422235,"DRAPER POINT OF",5251,4080,3449,3056,2202,1499,957,658,1172,1826,2289,2627,3569,4636]
["UT",41,{"$f":"CONCATENATE(A473,\"-\",B473)","v":"UT-41"},422253,"DUCHESNE",7205,5853,5119,4666,3665,2811,2102,131,420,892,1252,1528,2321,3247]
["UT",42,"UT-42",422257,"DUGWAY",5963,4726,4046,3631,2698,1928,1319,580,1038,1625,2040,2348,3213,4210]
["UT",43,"UT-43",422385,"ECHO DAM",7647,6177,5375,4872,3739,2788,2006,68,255,611,904,1132,1815,2650]
["UT",44,"UT-44",422418,"ELBERTA",6334,5062,4363,3925,2946,2116,1450,397,815,1369,1765,2057,2884,3839]
["UT",45,"UT-45",422424,"ELECTRIC LAKE U",11452,9662,8635,7981,6471,5154,4003,0,1,35,103,180,488,963]
["UT",46,"UT-46",422561,"ENTERPRISE BERY",6780,5390,4639,4170,3110,2218,1487,126,377,814,1157,1418,2172,3058]
["UT",47,"UT-47",422578,"EPHRAIM SORENSE",6547,5234,4518,4069,3056,2207,1511,238,592,1106,1486,1767,2567,3496]
["UT",48,"UT-48",422592,"ESCALANTE",5946,4665,3975,3550,2593,1797,1161,242,607,1153,1560,1861,2715,3699]
["UT",49,"UT-49",422607,"ESKDALE",5933,4689,4017,3602,2679,1909,1289,396,831,1413,1838,2150,3028,4033]
["UT",50,"UT-50",422696,"FAIRFIELD",6799,5411,4654,4180,3124,2241,1534,126,391,826,1163,1421,2176,3079]
["UT",51,"UT-51",422726,"FARMINGTON COUR",5913,4657,3981,3559,2614,1828,1192,461,886,1459,1876,2185,3051,4047]
["UT",52,"UT-52",422798,"FERRON",6557,5265,4563,4124,3134,2291,1597,257,624,1158,1550,1843,2665,3611]
["UT",53,"UT-53",422828,"FILLMORE",5900,4647,3969,3549,2615,1845,1232,329,748,1322,1738,2045,2912,3914]
["UT",54,"UT-54",422852,"FISH SPRINGS RE",5729,4535,3885,3487,2594,1851,1260,684,1183,1814,2259,2585,3486,4513]
["UT",55,"UT-55",422864,"FLAMING GORGE",7723,6246,5442,4935,3782,2809,2002,58,241,591,881,1104,1770,2585]
["UT",56,"UT-56",422996,"FORT DUCHESNE",7324,6010,5296,4853,3855,3012,2312,260,614,1118,1489,1769,2564,3489]
["UT",57,"UT-57",423012,"FREMONT INDIAN",6701,5329,4576,4105,3042,2153,1434,143,437,892,1233,1491,2244,3145]
["UT",58,"UT-58",423097,"GARFIELD",5364,4187,3548,3153,2280,1557,999,780,1300,1948,2404,2737,3663,4715]
["UT",{"$f":"IF(A490=A491,B490+1,1)","v":59},"UT-59",423138,"GARRISON",5967,4693,4001,3570,2610,1820,1195,327,724,1273,1676,1974,2820,3804]
["UT",60,"UT-60",423418,"GREEN RIVER AVI",5442,4333,3734,3362,2532,1850,1315,740,1292,1987,2472,2822,3786,4870]
["UT",61,"UT-61",423486,"GROUSE CREEK",7723,6242,5428,4919,3757,2766,1948,107,300,644,928,1147,1804,2604]
["UT",62,"UT-62",423514,"GUNNISON",6227,4920,4210,3772,2778,1963,1303,210,561,1078,1465,1754,2582,3549]
["UT",63,"UT-63",423600,"HANS FLAT RANGE",5855,4640,3980,3566,2633,1850,1206,420,869,1476,1913,2229,3108,4102]
["UT",64,"UT-64",423611,"HANKSVILLE",5473,4341,3733,3358,2509,1799,1238,730,1278,1971,2453,2801,3758,4828]
["UT",65,"UT-65",423624,"HANNA",8136,6582,5743,5215,4021,3010,2174,22,137,409,663,863,1486,2261]
["UT",66,"UT-66",423671,"HARDWARE RANCH",8673,7048,6152,5590,4306,3211,2319,16,93,292,490,659,1197,1897]
["UT",67,"UT-67",423809,"HEBER",7011,5608,4847,4371,3309,2431,1716,103,344,765,1097,1354,2105,3006]
["UT",68,"UT-68",423896,"HIAWATHA",7810,6345,5548,5048,3907,2908,2066,69,257,617,914,1144,1817,2614]
["UT",69,"UT-69",423980,"HITE RANGER STA",4013,3032,2514,2195,1495,948,567,1398,2117,2960,3528,3934,5032,6258]
["UT",70,"UT-70",424100,"HOVENWEEP NM",5739,4509,3841,3425,2478,1703,1088,421,871,1468,1895,2208,3088,4099]
["UT",71,"UT-71",424135,"HUNTSVILLE MONA",7621,6136,5328,4822,3686,2735,1962,71,251,592,878,1102,1787,2632]
["UT",72,"UT-72",424174,"IBAPAH",6849,5415,4639,4155,3066,2167,1444,106,327,719,1037,1284,2011,2894]
["UT",73,"UT-73",424342,"JENSEN",7292,5961,5257,4816,3821,2980,2286,204,524,1019,1393,1673,2473,3403]
["UT",74,"UT-74",424362,"JOHNSON PASS",6282,5002,4300,3861,2865,2022,1330,373,776,1319,1711,2001,2820,3754]
["UT",75,"UT-75",424467,"KAMAS",7816,6306,5487,4976,3814,2819,1987,42,191,506,782,999,1653,2451]
["UT",76,"UT-76",424508,"KANAB",5007,3800,3150,2747,1860,1142,627,302,742,1360,1805,2134,3054,4122]
["UT",77,"UT-77",424527,"KANOSH",5714,4500,3842,3434,2530,1785,1194,505,969,1578,2015,2331,3221,4237]
["UT",78,"UT-78",424748,"KNOLLS 10 NE",6559,5280,4577,4139,3145,2306,1610,479,897,1443,1836,2127,2952,3899]
["UT",79,"UT-79",424755,"KODACHROME BASI",5926,4614,3904,3463,2466,1641,987,166,490,1001,1389,1676,2502,3466]
["UT",80,"UT-80",424764,"KOOSHAREM",7686,6149,5322,4805,3627,2613,1781,17,126,414,681,896,1537,2324]
["UT",81,"UT-81",424856,"LAKETOWN",8492,6913,6051,5512,4286,3242,2375,32,145,393,626,815,1405,2148]
["UT",82,"UT-82",424947,"LA SAL 1 SW",7067,5679,4921,4446,3364,2435,1672,131,394,830,1168,1423,2158,3022]
["UT",83,"UT-83",424968,"LA VERKIN",3466,2496,1982,1672,1012,533,241,1154,1865,2720,3300,3720,4873,6199]
["UT",84,"UT-84",425065,"LEVAN",6194,4920,4225,3791,2821,2013,1360,327,731,1283,1682,1978,2812,3777]
["UT",85,"UT-85",425138,"LITTLE SAHARA D",6838,5508,4773,4314,3264,2384,1663,307,662,1158,1519,1786,2552,3444]
["UT",86,"UT-86",425148,"LOA",7784,6247,5418,4903,3731,2722,1894,14,119,406,676,888,1531,2317]
["UT",87,"UT-87",425182,"LOGAN RADIO KVN",7174,5799,5057,4589,3552,2691,1988,223,522,975,1323,1579,2333,3235]
["UT",88,"UT-88",425186,"LOGAN UTAH STAT LGU",6723,5406,4687,4241,3233,2398,1703,327,684,1192,1567,1849,2648,3580]
["UT",89,"UT-89",425194,"LOGAN 5 SW EXP",7554,6122,5347,4856,3771,2867,2136,140,374,766,1078,1316,2020,2879]
["UT",90,"UT-90",425252,"LYTLE RANCH",3355,2367,1849,1532,870,407,141,981,1666,2502,3078,3494,4657,6018]
["UT",91,"UT-91",425268,"MAESER 9 NW",7726,6289,5507,5016,3894,2929,2117,101,324,713,1026,1263,1963,2801]
["UT",92,"UT-92",425377,"MANILA",7331,5907,5129,4640,3536,2614,1844,107,338,738,1054,1295,2007,2854]
["UT",93,"UT-93",425402,"MANTI",6810,5431,4682,4214,3156,2270,1547,120,386,833,1179,1439,2198,3094]
["UT",94,"UT-94",425477,"MARYSVALE",6197,4845,4115,3661,2641,1800,1122,105,383,856,1222,1497,2298,3242]
["UT",95,"UT-95",425582,"MEXICAN HAT",4703,3615,3028,2661,1867,1225,766,919,1515,2254,2761,3124,4126,5264]
["UT",96,"UT-96",425654,"MILFORD         MLF",6116,4844,4154,3726,2773,1980,1352,314,715,1269,1669,1963,2802,3772]
["UT",97,"UT-97",425733,"MOAB",4455,3439,2897,2561,1823,1236,794,1084,1743,2546,3091,3480,4543,5730]
["UT",98,"UT-98",425752,"MODENA",6192,4878,4165,3719,2714,1884,1215,208,547,1061,1441,1727,2535,3478]
["UT",99,"UT-99",425805,"MONTICELLO",7288,5845,5063,4573,3463,2510,1732,59,257,640,954,1194,1902,2750]
["UT",100,"UT-100",425812,"MONUMENT VLY MI",4374,3334,2774,2428,1681,1080,648,951,1600,2386,2921,3304,4356,5533]
["UT",101,"UT-101",425826,"MORGAN POWER AN",7355,5923,5140,4652,3557,2651,1900,133,358,751,1062,1305,2019,2880]
["UT",102,"UT-102",425837,"MORONI",7248,5810,5029,4544,3445,2522,1761,85,292,678,995,1238,1958,2815]
["UT",103,"UT-103",425892,"MOUNTAIN DELL D",6954,5565,4806,4331,3256,2344,1595,129,392,827,1164,1418,2160,3038]
["UT",104,"UT-104",425969,"MYTON",7345,6016,5303,4860,3859,3016,2307,201,525,1018,1389,1667,2462,3388]
["UT",105,{"$f":"CONCATENATE(A537,\"-\",B537)","v":"UT-105"},426053,"NATURAL BRIDGES",6180,4907,4218,3788,2801,1970,1283,262,645,1199,1605,1901,2729,3676]
["UT",106,"UT-106",426123,"NEOLA",7580,6174,5410,4933,3865,2951,2192,112,352,772,1101,1354,2091,2964]
["UT",107,"UT-107",426135,"NEPHI",5856,4616,3946,3529,2596,1816,1190,374,811,1397,1822,2134,3008,4010]
["UT",108,"UT-108",426181,"NEW HARMONY",5704,4437,3753,3327,2370,1578,952,241,631,1191,1601,1905,2758,3742]
["UT",109,"UT-109",426357,"OAK CITY",5634,4443,3793,3395,2500,1754,1166,652,1153,1788,2234,2558,3458,4480]
["UT",110,"UT-110",426404,"OGDEN PIONEER P",5868,4644,3979,3564,2631,1854,1220,521,980,1580,2009,2325,3203,4203]
["UT",111,"UT-111",426414,"OGDEN SUGAR FAC",5896,4650,3980,3567,2646,1889,1284,477,909,1491,1913,2226,3105,4116]
["UT",112,"UT-112",426455,"OLMSTEAD P H",5620,4391,3729,3317,2405,1655,1063,449,893,1490,1923,2240,3140,4169]
["UT",113,"UT-113",426534,"ORDERVILLE",5261,4029,3367,2958,2039,1293,735,302,712,1305,1740,2057,2955,3990]
["UT",114,"UT-114",426538,"OREM TREATMENT",5564,4370,3737,3342,2471,1769,1222,524,1016,1648,2095,2420,3340,4392]
["UT",115,"UT-115",426568,"OURAY 4 NE",6964,5744,5082,4671,3746,2961,2307,380,817,1404,1827,2137,3005,3986]
["UT",116,"UT-116",426601,"PANGUITCH",7319,5854,5063,4571,3451,2488,1697,43,211,569,874,1111,1811,2646]
["UT",117,"UT-117",426658,"PARK VALLEY",7245,5825,5048,4562,3453,2513,1736,177,428,833,1151,1395,2106,2954]
["UT",118,"UT-118",426686,"PAROWAN POWER P",6523,5190,4465,4013,2975,2104,1381,168,481,973,1342,1619,2397,3296]
["UT",119,"UT-119",426708,"PARTOUN",6115,4847,4157,3725,2766,1962,1317,367,783,1340,1744,2043,2889,3868]
["UT",120,"UT-120",426869,"PINE VIEW DAM",8168,6682,5867,5358,4194,3198,2383,63,238,575,858,1077,1727,2521]
["UT",121,"UT-121",426919,"PLEASANT GROVE",5848,4602,3926,3508,2577,1804,1193,366,796,1377,1796,2106,2977,3981]
["UT",122,"UT-122",427064,"PROVO BYU",5264,4080,3446,3056,2197,1498,960,534,1028,1667,2129,2464,3404,4478]
["UT",{"$f":"IF(A554=A555,B554+1,1)","v":123},"UT-123",427165,"RANDOLPH",10165,8487,7543,6947,5580,4387,3360,10,56,204,353,489,943,1551]
["UT",124,"UT-124",427260,"RICHFIELD RADIO",6261,4916,4188,3737,2737,1912,1265,120,418,900,1266,1545,2348,3300]
["UT",125,"UT-125",427271,"RICHMOND",6951,5598,4861,4399,3365,2508,1801,257,578,1049,1406,1671,2442,3352]
["UT",126,"UT-126",427318,"RIVERDALE",6142,4856,4159,3724,2758,1952,1309,358,746,1286,1683,1978,2816,3791]
["UT",127,"UT-127",427395,"ROOSEVELT RADIO",7550,6204,5485,5037,4019,3159,2440,178,483,965,1327,1601,2383,3292]
["UT",128,"UT-128",427408,"ROSETTE",7427,6000,5215,4722,3594,2623,1821,178,422,819,1129,1368,2056,2877]
["UT",129,"UT-129",427516,"ST GEORGE",3103,2202,1731,1449,855,441,193,1684,2471,3393,4017,4465,5696,7109]
["UT",130,"UT-130",427557,"SALINA",6457,5136,4419,3970,2978,2144,1474,203,543,1048,1423,1705,2513,3461]
["UT",131,"UT-131",427559,"SALINA 24 E",8688,7096,6230,5687,4435,3338,2402,10,87,321,549,736,1298,1998]
["UT",132,"UT-132",427578,"SALTAIR SALT PL",5871,4637,3962,3542,2610,1832,1211,523,971,1559,1983,2291,3166,4168]
["UT",133,"UT-133",427598,"SALT LAKE CITY  SLC",5631,4381,3716,3299,2367,1594,995,605,1066,1708,2139,2452,3345,4396]
["UT",134,"UT-134",427606,"SALT LAKE TRIAD",5095,3928,3304,2925,2087,1411,895,679,1190,1848,2317,2660,3623,4713]
["UT",135,"UT-135",427686,"SANTAQUIN CHLOR",6180,4906,4210,3777,2812,1999,1341,422,826,1375,1774,2069,2903,3863]
["UT",136,"UT-136",427714,"SCIPIO",6839,5487,4743,4276,3228,2350,1637,206,525,999,1349,1612,2371,3265]
["UT",137,"UT-137",427724,"SCOFIELD DAM",10329,8624,7677,7085,5724,4531,3498,0,25,146,295,429,883,1483]
["UT",138,"UT-138",427729,"SCOFIELD-SKYLAN",9821,8104,7144,6539,5148,3916,2850,0,22,130,266,390,816,1385]
["UT",139,"UT-139",427846,"SILVER LAKE BRI",10318,8569,7578,6949,5499,4213,3085,0,13,89,194,297,667,1180]
["UT",140,"UT-140",427909,"SNAKE CREEK POW",7922,6382,5546,5027,3854,2862,2037,32,161,447,706,917,1560,2362]
["UT",141,"UT-141",427931,"SNOWVILLE",7383,5984,5215,4728,3625,2695,1942,176,450,878,1200,1445,2151,3003]
["UT",142,"UT-142",427959,"SOLDIER SUMMIT",10441,8700,7725,7112,5701,4460,3394,0,13,97,217,334,745,1313]
["UT",143,"UT-143",428119,"SPANISH FORK PW",5663,4451,3798,3396,2504,1759,1166,442,907,1521,1965,2291,3198,4235]
["UT",144,"UT-144",428474,"SUNNYSIDE",7484,6064,5290,4803,3687,2711,1890,90,315,720,1041,1285,1984,2807]
["UT",145,"UT-145",428478,"SUNNYSIDE CITY",6849,5508,4781,4322,3282,2376,1620,199,509,991,1357,1631,2407,3304]
["UT",146,"UT-146",428668,"THIOKOL PLANT 7",6954,5621,4887,4428,3398,2529,1823,298,646,1138,1498,1767,2537,3444]
["UT",147,"UT-147",428705,"THOMPSON",5563,4418,3794,3417,2549,1828,1253,690,1234,1911,2381,2722,3658,4709]
["UT",148,"UT-148",428733,"TIMPANOGOS CAVE",6456,5176,4472,4032,3030,2165,1445,374,774,1318,1711,2001,2815,3745]
["UT",149,"UT-149",428771,"TOOELE",5755,4524,3856,3440,2512,1741,1128,539,988,1581,2007,2320,3199,4202]
["UT",150,"UT-150",428817,"TREMONTON",6482,5182,4474,4032,3044,2216,1543,352,730,1257,1643,1929,2748,3700]
["UT",151,"UT-151",428828,"TRENTON",7708,6243,5442,4945,3830,2896,2133,119,323,683,977,1208,1896,2734]
["UT",152,"UT-152",428847,"TROPIC",6103,4727,3990,3534,2521,1688,1044,120,376,826,1186,1460,2255,3198]
["UT",153,"UT-153",428973,"UTAH LAKE LEHI",6481,5154,4428,3974,2957,2109,1431,265,610,1107,1477,1753,2546,3476]
["UT",154,"UT-154",429111,"VERNAL AP       VEL",7347,6000,5264,4810,3785,2912,2189,190,499,979,1338,1606,2378,3283]
["UT",155,"UT-155",429133,"VERNON",6697,5350,4610,4148,3098,2220,1502,229,553,1032,1388,1655,2418,3318]
["UT",156,"UT-156",429136,"VEYO POWERHOUSE",4395,3278,2679,2312,1510,887,458,535,1077,1784,2279,2641,3649,4809]
["UT",157,"UT-157",429152,"WAH WAH RANCH",5757,4522,3850,3434,2517,1760,1165,451,899,1490,1915,2229,3107,4123]
["UT",158,"UT-158",429165,"WANSHIP DAM",7570,6084,5276,4776,3639,2672,1875,67,239,578,864,1093,1775,2602]
["UT",159,"UT-159",429382,"WENDOVER",6002,4783,4116,3698,2756,1961,1324,615,1088,1694,2123,2433,3306,4302]
["UT",160,"UT-160",429595,"WOODRUFF",9649,7993,7072,6494,5170,4029,3087,8,60,229,403,555,1048,1700]
["WA",1,{"$f":"CONCATENATE(A593,\"-\",B593)","v":"WA-1"},450008,"ABERDEEN",5161,3528,2685,2197,1222,580,216,1,34,224,478,720,1568,2753]
["WA",{"$f":"IF(A593=A594,B593+1,1)","v":2},"WA-2",450013,"ABERDEEN 20 NNE",5706,4082,3221,2709,1630,854,376,3,48,249,482,701,1436,2451]
["WA",3,"WA-3",450176,"ANACORTES",5138,3550,2738,2259,1309,675,299,2,54,290,572,824,1691,2867]
["WA",4,"WA-4",450217,"APPLETON",7176,5616,4760,4225,3035,2059,1306,61,201,469,709,904,1521,2320]
["WA",5,"WA-5",450456,"BARING",5851,4304,3493,3000,1945,1148,601,16,116,394,677,913,1674,2658]
["WA",6,"WA-6",450482,"BATTLE GROUND",5165,3646,2863,2392,1436,772,359,30,160,469,779,1037,1895,3022]
["WA",7,"WA-7",450574,"BELLINGHAM INTL BLI",5400,3820,3000,2512,1516,830,407,5,67,312,586,827,1635,2726]
["WA",8,"WA-8",450587,"BELLINGHAM 3 SS",4980,3417,2621,2153,1234,633,276,5,68,329,629,894,1797,3014]
["WA",9,"WA-9",450668,"BICKLETON",6810,5341,4539,4037,2919,2010,1295,143,358,712,1003,1230,1922,2782]
["WA",10,"WA-10",450729,"BLAINE",5862,4224,3371,2861,1794,1027,537,0,27,214,456,674,1412,2417]
["WA",11,"WA-11",450844,"BOUNDARY DAM",7473,5969,5146,4629,3453,2471,1693,80,256,576,849,1061,1708,2520]
["WA",12,"WA-12",450872,"BREMERTON",4994,3503,2730,2270,1319,663,272,24,158,493,816,1086,1957,3105]
["WA",13,"WA-13",450945,"BUCKLEY 1 NE",5522,3965,3145,2650,1629,908,455,21,124,391,666,902,1684,2743]
["WA",14,"WA-14",451160,"CARSON FISH HAT",6493,4930,4085,3567,2428,1544,895,28,140,401,653,862,1541,2437]
["WA",15,"WA-15",451233,"CEDAR LAKE",6490,4856,3961,3417,2231,1323,697,10,66,256,459,642,1267,2130]
["WA",16,"WA-16",451276,"CENTRALIA",4500,3099,2382,1962,1116,556,230,56,255,679,1058,1370,2349,3613]
["WA",17,"WA-17",451350,"CHELAN",5997,4689,3984,3554,2602,1845,1245,334,693,1208,1601,1897,2759,3780]
["WA",18,"WA-18",451395,"CHEWELAH",6965,5507,4714,4219,3115,2213,1509,140,360,727,1031,1262,1968,2837]
["WA",19,"WA-19",451400,"CHIEF JOSEPH DA",5998,4703,4006,3575,2635,1889,1303,402,783,1310,1705,2005,2865,3888]
["WA",20,"WA-20",451484,"CLEARBROOK",5430,3877,3074,2597,1618,933,498,6,79,352,645,894,1717,2806]
["WA",21,"WA-21",451496,"CLEARWATER",5596,3889,2987,2456,1398,692,289,0,11,131,323,523,1280,2378]
["WA",22,{"$f":"CONCATENATE(A614,\"-\",B614)","v":"WA-22"},451504,"CLE ELUM",6810,5317,4505,3999,2876,1976,1284,91,275,607,888,1111,1800,2673]
["WA",23,"WA-23",451586,"COLFAX",6425,4939,4132,3636,2561,1713,1098,79,263,603,893,1122,1838,2749]
["WA",24,"WA-24",451666,"CONCONULLY",7392,5934,5139,4638,3508,2575,1815,151,372,738,1036,1266,1954,2802]
["WA",25,"WA-25",451679,"CONCRETE PPL FI",5518,3988,3192,2716,1712,975,486,17,121,417,716,969,1780,2828]
["WA",26,"WA-26",451690,"CONNELL 1 W",5538,4224,3533,3113,2202,1499,995,277,616,1129,1521,1819,2699,3754]
["WA",27,"WA-27",451760,"COUGAR 6 E",5290,3843,3090,2637,1676,964,483,94,299,676,1019,1293,2142,3208]
["WA",28,"WA-28",451767,"COULEE DAM 1 SW",6235,4907,4184,3738,2754,1963,1340,350,692,1187,1560,1843,2665,3643]
["WA",29,"WA-29",451783,"COUPEVILLE 1 S",5429,3761,2899,2387,1349,670,285,0,15,173,405,622,1405,2529]
["WA",30,"WA-30",451939,"CUSHMAN POWERHO",5542,3982,3164,2672,1632,879,398,13,100,365,643,881,1661,2700]
["WA",31,"WA-31",451968,"DALLESPORT AP   DLS",4681,3478,2856,2480,1678,1073,658,455,895,1519,1983,2327,3314,4464]
["WA",32,"WA-32",451992,"DARRINGTON RANG",5639,4156,3375,2899,1884,1127,601,46,204,546,860,1115,1917,2940]
["WA",33,"WA-33",452007,"DAVENPORT",7450,5942,5112,4591,3425,2468,1715,108,293,608,876,1084,1727,2540]
["WA",34,"WA-34",452030,"DAYTON 1 WSW",5547,4193,3480,3045,2101,1382,882,250,561,1032,1401,1685,2531,3561]
["WA",35,"WA-35",452157,"DIABLO DAM",6060,4570,3773,3283,2212,1380,775,62,231,566,866,1105,1851,2794]
["WA",36,"WA-36",452505,"ELLENSBURG",6785,5340,4554,4064,2986,2117,1452,115,330,710,1019,1260,1985,2888]
["WA",37,"WA-37",452531,"ELMA",5222,3683,2886,2407,1424,738,326,21,127,415,712,964,1796,2906]
["WA",38,"WA-38",452542,"ELTOPIA 8 WSW",5464,4132,3434,3011,2099,1410,920,177,477,970,1361,1656,2540,3612]
["WA",39,"WA-39",452548,"ELWHA R S",6332,4702,3809,3260,2078,1188,591,14,79,273,477,658,1294,2194]
["WA",{"$f":"IF(A631=A632,B631+1,1)","v":40},"WA-40",452563,"ENTIAT FISH HAT",6502,5102,4342,3874,2843,2023,1380,169,423,846,1183,1444,2229,3186]
["WA",41,"WA-41",452614,"EPHRATA AP",5836,4575,3897,3479,2575,1834,1272,490,900,1466,1884,2189,3070,4094]
["WA",42,"WA-42",452675,"EVERETT",5199,3647,2843,2361,1396,733,336,20,121,394,683,934,1782,2910]
["WA",43,"WA-43",452914,"FORKS 1 E",5673,4073,3194,2668,1577,803,342,0,32,205,421,626,1353,2378]
["WA",44,"WA-44",453177,"GLENOMA",5650,4093,3275,2783,1741,973,481,16,111,378,654,893,1658,2674]
["WA",45,"WA-45",453184,"GLENWOOD 2",7563,5908,4990,4419,3144,2113,1342,9,61,231,407,567,1099,1841]
["WA",46,"WA-46",453284,"GRAPEVIEW 3 SW",5101,3578,2788,2319,1338,655,252,12,113,414,719,980,1824,2944]
["WA",47,"WA-47",453320,"GRAYLAND",5362,3682,2764,2227,1180,540,192,0,13,115,291,483,1262,2447]
["WA",48,"WA-48",453333,"GRAYS RIVER HAT",5343,3717,2866,2372,1359,677,278,1,44,243,488,723,1535,2674]
["WA",49,"WA-49",453515,"HARRINGTON 1 NW",7178,5663,4840,4320,3183,2263,1557,75,245,558,829,1040,1702,2544]
["WA",50,"WA-50",453529,"HARTLINE",6487,5134,4397,3943,2934,2111,1456,304,619,1093,1451,1726,2517,3463]
["WA",51,"WA-51",453546,"HATTON 9 SE",5584,4286,3599,3177,2262,1549,1032,352,718,1244,1643,1940,2814,3856]
["WA",52,"WA-52",453730,"HOLDEN VILLAGE",8824,7160,6226,5642,4306,3154,2211,10,61,220,384,526,1016,1677]
["WA",53,"WA-53",453807,"HOQUIAM AP",5106,3461,2616,2130,1168,554,206,2,30,208,461,703,1568,2779]
["WA",54,"WA-54",453826,"HUMPTULIPS SALM",5704,4059,3160,2623,1517,756,317,0,16,146,340,534,1248,2286]
["WA",55,"WA-55",453883,"ICE HARBOR DAM",4979,3727,3072,2677,1840,1214,776,354,752,1325,1756,2081,3032,4160]
["WA",56,"WA-56",454154,"KENNEWICK",4731,3532,2909,2537,1744,1156,741,460,909,1535,1996,2344,3339,4505]
["WA",57,"WA-57",454169,"KENT",4624,3202,2474,2045,1171,586,245,41,219,623,989,1288,2238,3469]
["WA",58,"WA-58",454338,"LACROSSE",5997,4609,3859,3402,2402,1615,1054,200,472,909,1250,1515,2301,3271]
["WA",59,"WA-59",454486,"LANDSBURG",5750,4171,3338,2833,1759,968,461,14,99,345,607,832,1573,2564]
["WA",60,"WA-60",454572,"LEAVENWORTH 3 S",6717,5311,4545,4067,3003,2140,1450,170,421,837,1164,1420,2175,3097]
["WA",61,"WA-61",454679,"LIND 3 NE",6033,4671,3933,3485,2500,1720,1146,254,552,1015,1371,1645,2453,3435]
["WA",62,"WA-62",454748,"LONG BEACH EXP",5443,3711,2793,2265,1228,580,223,0,8,100,279,481,1267,2445]
["WA",63,"WA-63",454764,"LONGMIRE RAINIE",7626,5967,5040,4462,3159,2070,1218,11,62,227,397,549,1069,1770]
["WA",64,"WA-64",454769,"LONGVIEW",4900,3409,2652,2201,1293,668,294,22,148,482,821,1100,2006,3182]
["WA",65,"WA-65",455133,"MAZAMA",7896,6403,5586,5072,3906,2913,2100,114,311,645,920,1136,1789,2590]
["WA",66,"WA-66",455224,"MC MILLIN RESER",5626,4045,3211,2705,1648,894,423,12,93,338,597,823,1577,2609]
["WA",67,"WA-67",455231,"MCNARY DAM",5050,3772,3102,2701,1844,1202,756,340,715,1264,1680,1999,2933,4043]
["WA",68,"WA-68",455326,"METHOW 2 S",6934,5557,4808,4340,3297,2441,1757,228,521,971,1314,1574,2344,3273]
["WA",69,"WA-69",455525,"MONROE",5195,3668,2878,2408,1453,784,372,24,143,440,747,1007,1859,2981]
["WA",70,"WA-70",455659,"MOUNT ADAMS RAN",6669,5154,4336,3827,2691,1786,1098,58,216,526,802,1024,1707,2570]
["WA",71,"WA-71",455678,"MOUNT VERNON 3",5197,3603,2786,2307,1337,699,322,0,47,277,557,806,1647,2804]
["WA",72,"WA-72",455688,"MOXEE CITY 10 E",6037,4653,3906,3445,2450,1663,1084,185,452,894,1240,1509,2312,3297]
["WA",73,"WA-73",455704,"MUD MOUNTAIN DA",6135,4512,3622,3083,1938,1089,550,15,78,280,486,678,1333,2255]
["WA",74,"WA-74",455840,"NEWHALEM",6043,4524,3714,3219,2143,1319,731,45,190,498,780,1016,1753,2702]
["WA",75,"WA-75",455844,"NEWPORT",7189,5682,4867,4357,3214,2273,1519,70,240,557,838,1057,1733,2572]
["WA",76,"WA-76",455946,"NORTHPORT",6594,5201,4443,3970,2916,2056,1382,166,424,856,1193,1454,2218,3146]
["WA",77,"WA-77",456011,"OAKVILLE",5145,3615,2823,2348,1374,701,298,19,129,425,727,981,1827,2956]
["WA",78,"WA-78",456039,"ODESSA",6582,5164,4397,3922,2885,2033,1376,192,435,842,1172,1426,2177,3090]
["WA",79,"WA-79",456096,"OLGA 2 SE",5670,3935,3029,2504,1448,739,327,0,1,94,284,488,1245,2326]
["WA",80,"WA-80",456114,"OLYMPIA AP      OLM",5531,3952,3132,2637,1576,795,334,19,97,349,621,857,1622,2668]
["WA",81,"WA-81",456123,"OMAK 4 N        OMK",6737,5387,4653,4196,3172,2328,1652,253,564,1038,1401,1674,2466,3407]
["WA",82,"WA-82",456215,"OTHELLO 6 ESE",6236,4819,4054,3587,2572,1771,1181,158,400,806,1135,1391,2168,3129]
["WA",83,"WA-83",456262,"PACKWOOD",5769,4257,3452,2957,1902,1113,582,42,189,502,792,1026,1788,2780]
["WA",84,"WA-84",456295,"PALMER 3 ESE",5847,4253,3402,2888,1809,1023,519,13,87,321,564,779,1504,2494]
["WA",85,"WA-85",456534,"PLAIN",7502,5934,5080,4548,3345,2341,1549,35,155,413,655,853,1471,2266]
["WA",86,{"$f":"CONCATENATE(A678,\"-\",B678)","v":"WA-86"},456610,"POMEROY",6017,4617,3869,3408,2405,1611,1038,176,432,857,1192,1456,2241,3204]
["WA",87,"WA-87",456624,"PORT ANGELES",5586,3940,3055,2523,1436,703,287,2,42,222,429,630,1361,2431]
["WA",88,"WA-88",456678,"PORT TOWNSEND",5124,3507,2667,2175,1186,555,208,1,40,246,504,740,1577,2771]
["WA",89,"WA-89",456747,"PRIEST RAPIDS D",4880,3704,3082,2715,1915,1294,836,655,1142,1792,2263,2612,3604,4743]
["WA",90,"WA-90",456768,"PROSSER",5135,3859,3191,2788,1930,1278,813,313,680,1228,1648,1969,2905,4014]
["WA",91,"WA-91",456789,"PULLMAN 2 NW",6688,5193,4385,3886,2789,1911,1244,94,276,605,893,1121,1820,2707]
["WA",92,"WA-92",456803,"PUYALLUP 2 W EX TIW",4991,3496,2727,2270,1340,693,303,24,153,485,811,1085,1967,3119]
["WA",93,"WA-93",456846,"QUILCENE 2 SW",5351,3830,3034,2552,1546,832,391,26,148,452,750,998,1811,2885]
["WA",94,"WA-94",456858,"QUILLAYUTE AP   UIL",5776,4052,3118,2564,1418,622,211,4,23,108,266,443,1124,2154]
["WA",95,"WA-95",456880,"QUINCY 1 S",5970,4665,3962,3531,2594,1847,1275,273,618,1139,1530,1826,2682,3699]
["WA",96,"WA-96",456898,"RAINIER PARADIS",9941,8265,7246,6590,5033,3635,2459,0,28,90,166,240,497,885]
["WA",97,"WA-97",456914,"RAYMOND 2 S",5768,4093,3198,2669,1570,809,358,0,24,175,375,575,1290,2321]
["WA",98,"WA-98",456974,"REPUBLIC",8018,6443,5580,5041,3822,2797,1985,43,166,416,649,841,1441,2210]
["WA",99,"WA-99",457015,"RICHLAND",5133,3870,3210,2807,1951,1307,849,345,739,1303,1725,2042,2973,4086]
["WA",100,"WA-100",457059,"RITZVILLE 1 SSE",6509,5099,4328,3851,2802,1949,1297,206,466,882,1209,1456,2201,3113]
["WA",101,"WA-101",457180,"ROSALIA",6839,5350,4535,4026,2912,2016,1336,109,303,638,918,1136,1815,2682]
["WA",102,"WA-102",457185,"ROSS DAM",6262,4764,3957,3458,2355,1486,847,85,266,591,881,1113,1828,2739]
["WA",103,"WA-103",457267,"SAINT JOHN",6418,4959,4176,3695,2640,1797,1169,128,337,703,1011,1250,1983,2892]
["WA",{"$f":"IF(A695=A696,B695+1,1)","v":104},"WA-104",457319,"SAPPHO 8 E",5701,4096,3235,2715,1625,852,386,11,76,298,528,742,1465,2480]
["WA",105,"WA-105",457342,"SATUS PASS 2 SS",7122,5565,4713,4183,3001,2046,1304,69,212,480,724,924,1556,2373]
["WA",106,"WA-106",457458,"SEATTLE URBAN S",4615,3163,2420,1983,1106,528,197,35,192,564,916,1210,2159,3405]
["WA",107,"WA-107",457470,"SEATTLE SAND PT",4756,3305,2564,2118,1209,592,238,25,174,550,902,1186,2099,3304]
["WA",108,"WA-108",457473,"SEATTLE TACOMA  SEA",4797,3324,2567,2112,1158,510,182,42,173,521,859,1134,2004,3183]
["WA",109,"WA-109",457507,"SEDRO WOOLLEY",5213,3647,2847,2376,1422,776,379,4,65,322,617,876,1730,2866]
["WA",110,"WA-110",457544,"SEQUIM 2 E",6305,4573,3634,3065,1857,983,451,0,9,103,259,418,1030,1938]
["WA",111,"WA-111",457584,"SHELTON         SHN",5227,3721,2933,2462,1473,767,330,23,147,464,774,1032,1863,2953]
["WA",112,"WA-112",457696,"SKAMANIA FISH H",5725,4143,3309,2810,1762,1005,509,19,104,349,608,840,1602,2628]
["WA",113,"WA-113",457727,"SMYRNA",5328,4075,3407,3002,2131,1455,963,398,808,1379,1803,2118,3033,4117]
["WA",114,"WA-114",457773,"SNOQUALMIE FALL",5393,3823,2998,2500,1488,797,377,14,101,354,625,859,1655,2752]
["WA",115,"WA-115",457938,"SPOKANE AP      GEG",6820,5395,4615,4127,3020,2081,1324,154,394,787,1101,1343,2060,2948]
["WA",116,"WA-116",458009,"STAMPEDE PASS   SMP",9156,7427,6449,5822,4368,3113,2073,1,35,131,248,352,721,1265]
["WA",117,"WA-117",458034,"STARTUP 1 E",5167,3629,2840,2375,1414,755,351,14,111,399,704,968,1820,2956]
["WA",118,"WA-118",458059,"STEHEKIN 4 NW",6597,5190,4425,3949,2873,1967,1249,188,442,859,1188,1441,2190,3091]
["WA",119,"WA-119",458089,"STEVENS PASS",9630,7860,6851,6204,4701,3392,2295,0,12,69,154,238,557,1051]
["WA",120,"WA-120",458207,"SUNNYSIDE",5205,3945,3281,2878,2012,1343,858,324,714,1278,1707,2028,2959,4058]
["WA",121,"WA-121",458278,"TACOMA 1",4650,3196,2451,2011,1130,548,217,24,167,538,890,1178,2123,3364]
["WA",122,"WA-122",458500,"TOLEDO",5082,3584,2813,2355,1416,755,347,29,164,492,814,1087,1961,3091]
["WA",123,"WA-123",458520,"TONASKET 4 NNE",6226,4864,4130,3675,2689,1911,1310,184,471,932,1293,1569,2389,3382]
["WA",124,"WA-124",458715,"UPPER BAKER DAM",6353,4766,3920,3401,2284,1415,784,13,90,328,576,788,1488,2404]
["WA",125,"WA-125",458773,"VANCOUVER 4 NNE",4990,3512,2752,2295,1372,727,338,41,197,545,881,1155,2041,3185]
["WA",126,"WA-126",458928,"WALLA WALLA RGN ALW",4882,3648,3006,2620,1794,1188,764,528,957,1544,1980,2313,3274,4412]
["WA",127,"WA-127",458959,"WAPATO",5553,4279,3596,3176,2272,1557,1020,389,779,1328,1741,2049,2943,3997]
["WA",128,"WA-128",459012,"WATERVILLE",7217,5806,5033,4547,3447,2527,1774,203,464,877,1198,1442,2159,3018]
["WA",129,"WA-129",459058,"WELLPINIT",6883,5460,4685,4201,3111,2201,1474,232,485,889,1211,1456,2181,3060]
["WA",130,"WA-130",459074,"WENATCHEE",5533,4286,3616,3206,2314,1608,1062,417,832,1409,1834,2153,3068,4139]
["WA",131,"WA-131",459082,"WENATCHEE AP    EAT",5950,4660,3961,3529,2587,1837,1258,390,775,1311,1704,2003,2863,3883]
["WA",132,"WA-132",824255,"WHIDBEY ISLAND",5783,4020,3072,2513,1413,708,312,0,1,63,211,382,1096,2191]
["WA",133,"WA-133",459200,"WHITMAN MISSION",5498,4153,3442,3008,2076,1384,905,193,487,960,1331,1614,2467,3517]
["WA",134,"WA-134",459238,"WILBUR",7254,5774,4965,4453,3312,2375,1633,135,341,686,973,1191,1860,2693]
["WA",135,"WA-135",459376,"WINTHROP 1 WSW",7487,6040,5249,4758,3653,2731,1991,110,324,701,1006,1243,1956,2829]
["WA",136,"WA-136",459465,"YAKIMA MUNICIPA YKM",6104,4650,3914,3457,2438,1604,976,185,431,927,1284,1559,2366,3358]
["WY",1,{"$f":"CONCATENATE(A729,\"-\",B729)","v":"WY-1"},480027,"AFTON",9915,8254,7320,6733,5387,4221,3223,13,74,237,399,544,1014,1650]
["WY",{"$f":"IF(A729=A730,B729+1,1)","v":2},"WY-2",480080,"ALBIN",6836,5467,4713,4246,3189,2309,1592,152,441,896,1239,1497,2240,3124]
["WY",3,"WY-3",480140,"ALTA 1 NNW",9102,7491,6594,6032,4741,3619,2660,42,145,359,556,723,1247,1917]
["WY",4,"WY-4",480270,"ARCHER",7495,6038,5240,4736,3589,2620,1811,88,296,666,962,1188,1855,2660]
["WY",5,"WY-5",480484,"BAGGS",8169,6670,5856,5344,4186,3213,2406,39,196,520,802,1022,1679,2490]
["WY",6,"WY-6",480540,"BASIN",7743,6390,5647,5186,4147,3281,2567,320,651,1123,1476,1738,2496,3393]
["WY",7,"WY-7",480552,"BATES CREEK NO",8348,6855,6030,5506,4304,3261,2399,97,291,626,895,1102,1715,2465]
["WY",8,"WY-8",480603,"BEDFORD 3 SE",10184,8479,7518,6908,5525,4319,3279,3,36,157,291,413,845,1436]
["WY",9,"WY-9",480695,"BIG PINEY       BPI",10669,8962,8009,7411,6037,4823,3767,0,26,145,286,417,866,1462]
["WY",10,"WY-10",480740,"BILLY CREEK",8200,6691,5854,5328,4128,3112,2283,138,336,651,912,1109,1704,2446]
["WY",11,"WY-11",480761,"BITTER CREEK 4",8685,7124,6267,5726,4486,3415,2525,32,155,416,657,843,1420,2140]
["WY",12,"WY-12",480778,"BLACK MOUNTAIN",7522,6117,5334,4839,3712,2747,1938,309,598,1021,1332,1567,2240,3032]
["WY",13,"WY-13",480865,"BONDURANT",11782,10003,8986,8335,6831,5517,4388,0,6,52,130,207,528,1027]
["WY",14,"WY-14",480915,"BORDER 3 N",9493,7872,6979,6419,5142,4049,3125,19,104,306,509,677,1215,1920]
["WY",15,"WY-15",480951,"BOULDER REARING",10784,9082,8130,7527,6142,4927,3878,0,31,153,297,424,864,1458]
["WY",16,"WY-16",481000,"BOYSEN DAM",7804,6467,5725,5261,4219,3336,2594,371,730,1220,1572,1834,2585,3466]
["WY",17,"WY-17",481165,"BUFFALO",7879,6442,5642,5140,4010,3058,2271,246,499,885,1182,1409,2086,2907]
["WY",18,"WY-18",481175,"BUFFALO BILL DA",7188,5668,4855,4353,3250,2344,1635,48,199,504,779,998,1672,2510]
["WY",19,"WY-19",481220,"BURGESS JUNCTIO",11713,10024,8988,8321,6740,5314,4048,0,8,46,106,169,409,788]
["WY",20,"WY-20",481284,"BURRIS",8394,6816,5949,5404,4159,3118,2249,31,144,392,619,805,1377,2098]
["WY",21,"WY-21",481547,"CARPENTER",7012,5621,4861,4381,3302,2399,1656,134,398,832,1167,1418,2147,3012]
["WY",22,"WY-22",481570,"CASPER NATRONA  CPR",7571,6145,5383,4898,3787,2825,2021,149,428,881,1213,1462,2174,3037]
["WY",23,"WY-23",481610,"CENTENNIAL 1 N",9120,7431,6501,5920,4592,3433,2446,0,28,165,328,478,969,1609]
["WY",24,"WY-24",481675,"CHEYENNE MUNICI CYS",7388,5848,5069,4583,3462,2500,1714,69,273,688,1005,1246,1947,2813]
["WY",25,"WY-25",481730,"CHUGWATER",7561,6095,5290,4780,3611,2637,1831,74,273,631,921,1140,1785,2575]
["WY",26,"WY-26",481736,"CHURCH BUTTES G",8957,7413,6567,6029,4796,3719,2809,67,220,500,745,936,1516,2221]
["WY",27,"WY-27",481775,"CLARK 3 NE",7992,6536,5734,5235,4106,3155,2372,146,369,738,1032,1255,1914,2715]
["WY",28,"WY-28",481816,"CLEARMONT 5 SW",8509,7012,6183,5661,4481,3475,2642,137,335,661,930,1135,1761,2530]
["WY",29,"WY-29",481840,"CODY",7243,5804,5019,4532,3450,2552,1838,178,417,803,1104,1339,2034,2880]
["WY",30,"WY-30",481850,"CODY 12 SE",7937,6454,5634,5119,3957,2968,2164,165,377,718,994,1201,1823,2589]
["WY",31,"WY-31",481855,"CODY 21 SW",7870,6320,5468,4929,3735,2723,1913,62,213,490,732,922,1508,2253]
["WY",32,"WY-32",481905,"COLONY",7250,5890,5153,4694,3663,2800,2103,369,697,1164,1504,1760,2503,3383]
["WY",33,"WY-33",482054,"CORA",10917,9171,8182,7547,6088,4806,3705,0,19,100,204,301,664,1190]
["WY",34,"WY-34",482242,"DANIEL FISH HAT",11404,9640,8639,8000,6523,5219,4088,0,11,72,169,259,602,1109]
["WY",35,"WY-35",482375,"DARWIN RANCH",12809,10992,9923,9229,7598,6150,4886,0,0,9,34,71,265,630]
["WY",36,"WY-36",482410,"DEAD HORSE CREE",8123,6688,5890,5381,4223,3246,2427,214,471,862,1156,1379,2024,2803]
["WY",37,"WY-37",482415,"DEAVER",8096,6679,5895,5405,4300,3370,2603,208,469,876,1188,1426,2120,2958]
["WY",38,"WY-38",482466,"DEVILS TOWER 2",8308,6846,6035,5525,4369,3391,2577,181,409,770,1054,1274,1925,2719]
["WY",39,"WY-39",482580,"DILLINGER",8034,6601,5802,5297,4160,3192,2387,229,484,875,1172,1398,2054,2844]
["WY",40,"WY-40",482595,"DIVERSION DAM",8335,6828,6004,5487,4309,3333,2497,70,240,558,828,1039,1670,2437]
["WY",41,"WY-41",482680,"DOUBLE FOUR RAN",8197,6610,5740,5195,3952,2891,2035,26,133,368,594,779,1353,2080]
["WY",42,"WY-42",482693,"DOUGLAS AVIATIO",7433,6030,5251,4755,3631,2680,1907,164,436,858,1175,1408,2088,2911]
["WY",43,"WY-43",482715,"DUBOIS",9245,7567,6629,6038,4681,3497,2507,8,49,194,352,491,954,1564]
["WY",44,"WY-44",482725,"DULL CENTER 1 S",7284,5908,5150,4675,3612,2724,1998,292,605,1055,1389,1638,2365,3233]
["WY",45,"WY-45",482881,"ECHETA 2 NW",7841,6411,5617,5118,4027,3085,2319,280,544,939,1241,1470,2151,2973]
["WY",46,"WY-46",482995,"ELK MOUNTAIN",8738,7122,6235,5678,4407,3306,2381,13,88,298,504,678,1220,1904]
["WY",47,"WY-47",483031,"EMBLEM",7708,6311,5545,5069,4000,3104,2359,214,486,915,1242,1489,2216,3082]
["WY",48,{"$f":"CONCATENATE(A776,\"-\",B776)","v":"WY-48"},483045,"ENCAMPMENT 10 E",8858,7194,6284,5718,4429,3325,2392,1,37,198,383,546,1075,1766]
["WY",49,"WY-49",483100,"EVANSTON 1 E",9054,7421,6521,5958,4661,3546,2607,11,79,271,466,629,1147,1827]
["WY",50,"WY-50",483170,"FARSON 5 N",10347,8714,7807,7236,5907,4745,3741,18,92,283,472,630,1124,1755]
["WY",51,"WY-51",483396,"FONTENELLE DAM",10505,8880,7962,7383,6035,4849,3827,48,148,349,527,672,1133,1723]
["WY",52,"WY-52",483801,"GAS HILLS 4 E",8619,7124,6298,5774,4568,3508,2606,87,275,604,871,1078,1686,2417]
["WY",53,"WY-53",483855,"GILLETTE 6 SE   GCC",8034,6582,5773,5261,4111,3137,2326,202,441,815,1101,1320,1963,2743]
["WY",54,"WY-54",483950,"GLENROCK 5 ESE",6835,5477,4734,4271,3231,2360,1651,274,596,1062,1411,1670,2423,3306]
["WY",55,"WY-55",483960,"GLENROCK 14 SSE",8406,6850,5994,5456,4213,3133,2239,36,166,433,673,862,1440,2152]
["WY",56,"WY-56",484036,"GRASS CREEK",7945,6470,5658,5149,3996,3032,2216,135,342,694,976,1196,1854,2652]
["WY",57,"WY-57",484065,"GREEN RIVER",8183,6696,5882,5370,4202,3221,2406,69,249,586,866,1084,1738,2535]
["WY",58,"WY-58",484080,"GREYBULL",7966,6585,5825,5344,4266,3342,2578,256,556,1001,1338,1585,2309,3164]
["WY",59,"WY-59",484411,"HEART MOUNTAIN",7421,5991,5214,4740,3673,2789,2069,155,394,788,1101,1347,2066,2934]
["WY",60,"WY-60",484760,"HULETT",7899,6468,5679,5180,4069,3131,2359,190,441,836,1141,1373,2051,2876]
["WY",61,"WY-61",484910,"JACKSON",9529,7858,6929,6346,5011,3856,2906,5,50,205,371,516,1003,1651]
["WY",62,"WY-62",484925,"JEFFREY CITY",8750,7221,6371,5836,4597,3519,2621,42,188,484,730,924,1497,2211]
["WY",63,"WY-63",485055,"KAYCEE",7896,6459,5669,5169,4031,3076,2283,189,439,829,1128,1354,2016,2818]
["WY",64,"WY-64",485085,"KEELINE 3 W",7640,6216,5429,4932,3797,2848,2053,170,421,820,1130,1362,2040,2854]
["WY",65,"WY-65",485088,"KEELINE 7 SW",7646,6219,5432,4934,3802,2849,2066,128,370,766,1073,1304,1982,2799]
["WY",{"$f":"IF(A793=A794,B793+1,1)","v":66},"WY-66",485105,"KEMMERER 2 N",9767,8126,7206,6629,5302,4146,3152,33,119,304,479,630,1114,1756]
["WY",67,"WY-67",485252,"LA BARGE",10026,8389,7483,6911,5600,4452,3469,11,77,264,454,613,1118,1770]
["WY",68,"WY-68",485260,"LA GRANGE",6461,5123,4394,3940,2935,2098,1432,225,555,1043,1407,1681,2463,3381]
["WY",69,"WY-69",485345,"LAKE YELLOWSTON P60",12223,10432,9392,8724,7143,5725,4468,0,4,38,94,156,397,785]
["WY",70,"WY-70",485390,"LANDER AP       LND",7790,6406,5651,5171,4062,3091,2267,154,445,900,1242,1491,2208,3061]
["WY",71,"WY-71",485415,"LARAMIE RGNL AP LAR",9038,7421,6537,5982,4700,3579,2645,7,71,281,491,665,1193,1860]
["WY",72,"WY-72",485435,"LARAMIE 2 NW",9233,7611,6718,6155,4850,3708,2738,10,75,276,479,645,1157,1799]
["WY",73,"WY-73",485506,"LEITER 9 N",7398,6020,5256,4781,3720,2829,2101,360,671,1117,1446,1695,2418,3279]
["WY",74,"WY-74",485770,"LOVELL",7932,6510,5726,5236,4137,3218,2473,233,492,896,1203,1438,2128,2971]
["WY",75,"WY-75",485830,"LUSK 2 SW",7991,6526,5716,5200,4025,3026,2203,100,309,669,953,1170,1803,2577]
["WY",76,"WY-76",486120,"MEDICINE BOW",8338,6806,5964,5433,4213,3166,2301,19,137,430,683,882,1479,2224]
["WY",77,"WY-77",486165,"MERNA",10959,9184,8174,7530,6042,4734,3600,0,6,56,141,227,561,1059]
["WY",78,"WY-78",486195,"MIDWEST",7537,6137,5365,4878,3779,2864,2102,214,494,921,1241,1482,2184,3030]
["WY",79,"WY-79",486395,"MOORCROFT 3 S",8360,6924,6123,5614,4457,3457,2619,227,484,875,1167,1389,2028,2793]
["WY",80,"WY-80",486428,"MOOSE",10296,8610,7661,7063,5692,4497,3470,7,49,189,335,468,920,1533]
["WY",81,"WY-81",486440,"MORAN 5 WNW",10210,8517,7563,6959,5572,4352,3299,6,44,175,316,442,878,1469]
["WY",82,"WY-82",486555,"MOUNTAIN VIEW",8364,6791,5938,5405,4193,3161,2298,17,116,365,608,802,1406,2161]
["WY",83,"WY-83",486595,"MUDDY GAP",7681,6249,5460,4962,3836,2870,2074,160,405,800,1106,1336,2021,2844]
["WY",84,"WY-84",486660,"NEWCASTLE",7426,6057,5297,4822,3749,2850,2100,313,631,1084,1420,1672,2400,3262]
["WY",85,"WY-85",486845,"OLD FAITHFUL",11468,9694,8678,8027,6506,5153,3969,0,9,59,140,217,520,981]
["WY",86,"WY-86",486852,"OLD FORT LARAMI",7030,5661,4903,4424,3340,2436,1706,207,514,970,1307,1558,2279,3143]
["WY",87,"WY-87",487105,"PATHFINDER DAM",7369,5956,5182,4696,3593,2665,1900,171,425,838,1157,1402,2113,2966]
["WY",88,"WY-88",487115,"PAVILLION",7784,6335,5540,5043,3946,3026,2268,117,336,714,1014,1246,1937,2777]
["WY",89,"WY-89",487200,"PHILLIPS",6944,5554,4788,4306,3227,2329,1593,158,434,871,1200,1448,2172,3035]
["WY",90,"WY-90",487235,"PINE BLUFFS",7123,5738,4970,4488,3386,2467,1710,176,463,904,1233,1480,2190,3039]
["WY",91,"WY-91",487240,"PINE BLUFFS 5 W",7398,5982,5199,4704,3570,2609,1816,102,345,753,1067,1302,1983,2800]
["WY",92,"WY-92",487260,"PINEDALE",10634,8907,7932,7313,5893,4650,3583,0,23,121,242,353,756,1323]
["WY",93,"WY-93",487376,"POWDER RIVER NO",7925,6497,5705,5208,4084,3135,2334,195,441,836,1139,1369,2045,2852]
["WY",94,"WY-94",487388,"POWELL FIELD ST",8122,6671,5871,5368,4232,3260,2462,147,373,746,1042,1270,1934,2735]
["WY",95,"WY-95",487533,"RAWLINS AP      RWL",7885,6416,5611,5102,3945,2943,2113,85,282,640,929,1150,1805,2595]
["WY",96,"WY-96",487548,"RECLUSE 11 NNW",8941,7468,6651,6129,4941,3910,3040,176,396,748,1025,1235,1853,2596]
["WY",97,"WY-97",487555,"REDBIRD",7316,5957,5207,4749,3707,2830,2117,331,657,1123,1468,1726,2469,3347]
["WY",98,"WY-98",487760,"RIVERTON",8365,6944,6160,5664,4560,3622,2836,177,433,838,1148,1382,2066,2889]
["WY",99,"WY-99",487810,"ROCHELLE 3 E",8123,6700,5909,5407,4259,3288,2471,235,503,906,1208,1437,2097,2890]
["WY",100,"WY-100",487845,"ROCK SPRINGS AP",8670,7157,6324,5796,4583,3518,2623,64,230,542,803,1006,1606,2334]
["WY",101,"WY-101",487955,"SAGE 4 NNW",9717,8067,7153,6580,5278,4161,3228,16,82,258,438,595,1112,1790]
["WY",102,"WY-102",487990,"SARATOGA",8107,6585,5755,5233,4043,3024,2177,26,159,462,728,936,1560,2335]
["WY",103,"WY-103",488070,"SEMINOE DAM",8020,6564,5763,5253,4083,3075,2230,103,322,692,985,1205,1850,2631]
["WY",104,"WY-104",488124,"SHELL",8075,6645,5857,5367,4259,3311,2533,172,413,809,1114,1349,2031,2851]
["WY",105,"WY-105",488155,"SHERIDAN AP     SHR",7721,6230,5459,4973,3863,2913,2118,144,398,827,1148,1395,2113,2986]
["WY",106,"WY-106",488160,"SHERIDAN FIELD",7827,6398,5608,5117,4020,3091,2328,228,484,881,1184,1416,2100,2926]
["WY",107,"WY-107",488192,"SHIRLEY BASIN",10847,9128,8170,7566,6163,4900,3792,0,20,127,263,388,807,1352]
["WY",108,"WY-108",488315,"SNAKE RIVER",11565,9790,8775,8122,6597,5243,4062,0,11,63,143,219,517,976]
["WY",109,"WY-109",488385,"SOUTH PASS CITY",11547,9780,8769,8118,6597,5246,4067,0,13,70,156,236,538,997]
["WY",110,"WY-110",488705,"SUNDANCE",8166,6709,5903,5391,4236,3256,2444,195,428,797,1084,1304,1957,2751]
["WY",111,"WY-111",488758,"SUNSHINE 3 NE",9401,7743,6809,6219,4868,3698,2721,13,72,237,400,540,1008,1627]
["WY",112,{"$f":"CONCATENATE(A840,\"-\",B840)","v":"WY-112"},488808,"SYBILLE RESEARC",7754,6312,5514,5012,3865,2886,2082,80,298,684,981,1207,1872,2679]
["WY",113,"WY-113",488852,"TEN SLEEP 4 NE",6748,5420,4699,4251,3247,2407,1716,308,654,1151,1525,1800,2595,3515]
["WY",114,"WY-114",488858,"TEN SLEEP 16 SS",8654,7175,6351,5831,4633,3607,2763,136,345,689,962,1171,1789,2546]
["WY",115,"WY-115",488875,"THERMOPOLIS",6877,5557,4837,4391,3398,2573,1887,309,667,1173,1547,1826,2630,3565]
["WY",116,"WY-116",488880,"THERMOPOLIS 2",7502,6096,5322,4836,3747,2851,2108,195,462,881,1202,1445,2164,3034]
["WY",117,"WY-117",488888,"THERMOPOLIS 25",8323,6760,5898,5355,4115,3082,2231,82,234,498,729,917,1496,2243]
["WY",118,"WY-118",488995,"TORRINGTON EXP",6908,5564,4823,4353,3307,2430,1719,240,575,1056,1410,1670,2421,3309]
["WY",119,"WY-119",489025,"TOWER FALLS",10726,8989,8004,7374,5926,4651,3562,2,23,112,222,321,696,1234]
["WY",120,"WY-120",489205,"UPTON",7952,6548,5768,5275,4169,3230,2445,248,529,950,1265,1502,2189,3012]
["WY",121,"WY-121",489459,"WAMSUTTER",8998,7457,6606,6070,4822,3737,2822,34,169,454,698,890,1461,2169]
["WY",122,"WY-122",489467,"WAPITI 1 NE",7882,6319,5462,4922,3703,2693,1875,64,207,472,709,899,1484,2228]
["WY",123,"WY-123",489580,"WESTON 1 E",7332,5916,5145,4670,3609,2732,2030,262,528,937,1252,1493,2210,3079]
["WY",124,"WY-124",489604,"WHALEN DAM (USB",6389,5074,4356,3912,2934,2119,1475,305,664,1174,1551,1833,2639,3582]
["WY",125,"WY-125",489615,"WHEATLAND 4 N",6321,4982,4255,3802,2809,1997,1362,234,569,1055,1417,1688,2479,3424]
["WY",126,"WY-126",489770,"WORLAND",7928,6554,5796,5315,4247,3341,2597,301,613,1062,1398,1651,2375,3237]
["WY",127,"WY-127",489785,"WORLAND MUNICIP WRL",7426,6098,5370,4913,3907,3059,2354,376,733,1230,1597,1870,2652,3568]
["WY",128,"WY-128",489905,"YELLOWSTONE PAR",9488,7859,6942,6363,5024,3855,2872,36,130,325,504,655,1133,1754]
["WY",129,"WY-129",489925,"YODER 2 WSW",6695,5346,4605,4141,3114,2256,1569,234,556,1030,1383,1648,2410,3312]

{"sheet":"Chiller Data","index":7,"n_rows":348,"n_cols":29,"rows_kept":348,"cut":false,"hidden":true,"merged":[[313,2,313,23],[276,2,276,23],[243,2,243,23],[3,2,3,23],[33,2,33,23],[211,2,211,23],[63,2,63,23],[174,2,174,23],[137,2,137,23],[100,2,100,23]]}
[]
[]
[null,"Equipment ID","State","Heat Rejection","Type","Size","Size ID","Minimum COP (kW/ton)","Minimum IPLV (kW/ton)",null,null,"Unit","DEER Baseline Efficiency","DEER New Efficiency (kW/ton)","DEER Baseline cost","DEER Incremental Cost ($/ton)","($/ton/(0.1 kW/ton) increase)",null,null,"Minimum Full Load (COP)","Minimum IPLV (COP)",null,null,"Unit"]
[null,null,"Wyoming Chiller Data (IECC 2003)"]
[null,{"$f":"CONCATENATE(C5,\"-\",D5,\"-\",E5,\"-\",G5)","v":"WY-Air Cooled-Reciprocating-1"},"WY","Air Cooled","Reciprocating","<150 tons",1,{"$f":"12/(T5*3.412)","v":1.2560710098810921},{"$f":"12/(U5*3.412)","v":1.2560710098810921},"Does Not Apply","Does Not Apply","kW/ton",1.26,1.008,448.95363636363641,39.935252525252508,{"$f":"P5/((M5-N5)/0.1)","v":15.847322430655757},null,null,2.8,2.8,"Does Not Apply","Does Not Apply","COP"]
[null,"WY-Air Cooled-Reciprocating-2","WY","Air Cooled","Reciprocating","≥150 tons and <300 tons",2,1.4067995310668231,1.4067995310668231,"Does Not Apply","Does Not Apply","kW/ton",1.26,1.008,448.95363636363641,39.935252525252508,15.847322430655757,null,null,2.5,2.5,"Does Not Apply","Does Not Apply","COP"]
[null,"WY-Air Cooled-Reciprocating-3","WY","Air Cooled","Reciprocating","≥300 tons",3,1.4067995310668231,1.4067995310668231,"Does Not Apply","Does Not Apply","kW/ton",1.26,1.008,448.95363636363641,39.935252525252508,15.847322430655757,null,null,2.5,2.5,"Does Not Apply","Does Not Apply","COP"]
[null,"WY-Air Cooled-Screw-1","WY","Air Cooled","Screw","<150 tons",1,1.2560710098810921,1.2560710098810921,"Does Not Apply","Does Not Apply","kW/ton",1.26,1.008,445.89673980058745,42.339587093587625,16.80142344983636,null,null,2.8,2.8,"Does Not Apply","Does Not Apply","COP"]
[null,"WY-Air Cooled-Screw-2","WY","Air Cooled","Screw","≥150 tons and <300 tons",2,1.4067995310668231,1.4067995310668231,"Does Not Apply","Does Not Apply","kW/ton",1.26,1.008,445.89673980058745,42.339587093587625,16.80142344983636,null,null,2.5,2.5,"Does Not Apply","Does Not Apply","COP"]
[null,"WY-Air Cooled-Screw-3","WY","Air Cooled","Screw","≥300 tons",3,1.4067995310668231,1.4067995310668231,"Does Not Apply","Does Not Apply","kW/ton",1.26,1.008,445.89673980058745,42.339587093587625,16.80142344983636,null,null,2.5,2.5,"Does Not Apply","Does Not Apply","COP"]
[null,"WY-Air Cooled-Scroll-1","WY","Air Cooled","Scroll","<150 tons",1,1.2560710098810921,1.2560710098810921,"Does Not Apply","Does Not Apply","kW/ton",1.26,1.008,445.89673980058745,42.339587093587625,16.80142344983636,null,null,2.8,2.8,"Does Not Apply","Does Not Apply","COP"]
[null,"WY-Air Cooled-Scroll-2","WY","Air Cooled","Scroll","≥150 tons and <300 tons",2,1.4067995310668231,1.4067995310668231,"Does Not Apply","Does Not Apply","kW/ton",1.26,1.008,445.89673980058745,42.339587093587625,16.80142344983636,null,null,2.5,2.5,"Does Not Apply","Does Not Apply","COP"]
[null,"WY-Air Cooled-Scroll-3","WY","Air Cooled","Scroll","≥300 tons",3,1.4067995310668231,1.4067995310668231,"Does Not Apply","Does Not Apply","kW/ton",1.26,1.008,445.89673980058745,42.339587093587625,16.80142344983636,null,null,2.5,2.5,"Does Not Apply","Does Not Apply","COP"]
[null,"WY-Air Cooled-Rotary-1","WY","Air Cooled","Rotary","<150 tons",1,1.2560710098810921,1.2560710098810921,"Does Not Apply","Does Not Apply","kW/ton",1.26,1.008,445.89673980058745,42.339587093587625,16.80142344983636,null,null,2.8,2.8,"Does Not Apply","Does Not Apply","COP"]
[null,"WY-Air Cooled-Rotary-2","WY","Air Cooled","Rotary","≥150 tons and <300 tons",2,1.4067995310668231,1.4067995310668231,"Does Not Apply","Does Not Apply","kW/ton",1.26,1.008,445.89673980058745,42.339587093587625,16.80142344983636,null,null,2.5,2.5,"Does Not Apply","Does Not Apply","COP"]
[null,"WY-Air Cooled-Rotary-3","WY","Air Cooled","Rotary","≥300 tons",3,1.4067995310668231,1.4067995310668231,"Does Not Apply","Does Not Apply","kW/ton",1.26,1.008,445.89673980058745,42.339587093587625,16.80142344983636,null,null,2.5,2.5,"Does Not Apply","Does Not Apply","COP"]
[null,"WY-Water Cooled-Reciprocating-1","WY","Water Cooled","Reciprocating","<150 tons",1,0.83738067325406129,0.75634383390689408,"Does Not Apply","Does Not Apply","kW/ton",0.83699999999999997,0.67200000000000004,462.58824239497829,16.274341238578074,9.8632371142897473,null,null,4.2,4.6500000000000004,"Does Not Apply","Does Not Apply","COP"]
[null,"WY-Water Cooled-Reciprocating-2","WY","Water Cooled","Reciprocating","≥150 tons and <300 tons",2,0.83738067325406129,0.75634383390689408,"Does Not Apply","Does Not Apply","kW/ton",0.83699999999999997,0.67200000000000004,462.58824239497829,16.274341238578074,9.8632371142897473,null,null,4.2,4.6500000000000004,"Does Not Apply","Does Not Apply","COP"]
[null,"WY-Water Cooled-Reciprocating-3","WY","Water Cooled","Reciprocating","≥300 tons",3,0.83738067325406129,0.75634383390689408,"Does Not Apply","Does Not Apply","kW/ton",0.83699999999999997,0.67200000000000004,462.58824239497829,16.274341238578074,9.8632371142897473,null,null,4.2,4.6500000000000004,"Does Not Apply","Does Not Apply","COP"]
[null,"WY-Water Cooled-Screw-1","WY","Water Cooled","Screw","<150 tons",1,0.79033681520608023,0.78155529503712395,"Does Not Apply","Does Not Apply","kW/ton",0.79,0.63200000000000001,443.38924926972516,49.053878122290939,31.046758305247423,null,null,4.45,4.5,"Does Not Apply","Does Not Apply","COP"]
[null,"WY-Water Cooled-Screw-2","WY","Water Cooled","Screw","≥150 tons and <300 tons",2,0.71775486278919531,0.71050481367011253,"Does Not Apply","Does Not Apply","kW/ton",0.71799999999999997,0.57399999999999995,346.94119633464976,25.474144365156633,17.690378031358772,null,null,4.9000000000000004,4.95,"Does Not Apply","Does Not Apply","COP"]
[null,"WY-Water Cooled-Screw-3","WY","Water Cooled","Screw","≥300 tons",3,0.63945433230310145,0.62803550494054605,"Does Not Apply","Does Not Apply","kW/ton",0.63900000000000001,0.51100000000000001,275.83630822489715,11.398920686211682,8.9054067861028763,null,null,5.5,5.6,"Does Not Apply","Does Not Apply","COP"]
[null,"WY-Water Cooled-Scroll-1","WY","Water Cooled","Scroll","<150 tons",1,0.79033681520608023,0.78155529503712395,"Does Not Apply","Does Not Apply","kW/ton",0.79,0.63200000000000001,443.38924926972516,49.053878122290939,31.046758305247423,null,null,4.45,4.5,"Does Not Apply","Does Not Apply","COP"]
[null,"WY-Water Cooled-Scroll-2","WY","Water Cooled","Scroll","≥150 tons and <300 tons",2,0.71775486278919531,0.71050481367011253,"Does Not Apply","Does Not Apply","kW/ton",0.71799999999999997,0.57399999999999995,346.94119633464976,25.474144365156633,17.690378031358772,null,null,4.9000000000000004,4.95,"Does Not Apply","Does Not Apply","COP"]
[null,"WY-Water Cooled-Scroll-3","WY","Water Cooled","Scroll","≥300 tons",3,0.63945433230310145,0.62803550494054605,"Does Not Apply","Does Not Apply","kW/ton",0.63900000000000001,0.51100000000000001,275.83630822489715,11.398920686211682,8.9054067861028763,null,null,5.5,5.6,"Does Not Apply","Does Not Apply","COP"]
[null,"WY-Water Cooled-Rotary-1","WY","Water Cooled","Rotary","<150 tons",1,0.79033681520608023,0.78155529503712395,"Does Not Apply","Does Not Apply","kW/ton",0.79,0.63200000000000001,443.38924926972516,49.053878122290939,31.046758305247423,null,null,4.45,4.5,"Does Not Apply","Does Not Apply","COP"]
[null,"WY-Water Cooled-Rotary-2","WY","Water Cooled","Rotary","≥150 tons and <300 tons",2,0.71775486278919531,0.71050481367011253,"Does Not Apply","Does Not Apply","kW/ton",0.71799999999999997,0.57399999999999995,346.94119633464976,25.474144365156633,17.690378031358772,null,null,4.9000000000000004,4.95,"Does Not Apply","Does Not Apply","COP"]
[null,"WY-Water Cooled-Rotary-3","WY","Water Cooled","Rotary","≥300 tons",3,0.63945433230310145,0.62803550494054605,"Does Not Apply","Does Not Apply","kW/ton",0.63900000000000001,0.51100000000000001,275.83630822489715,11.398920686211682,8.9054067861028763,null,null,5.5,5.6,"Does Not Apply","Does Not Apply","COP"]
[null,"WY-Water Cooled-Centrifugal-1","WY","Water Cooled","Centrifugal","<150 tons",1,0.70339976553341155,0.70339976553341155,"Does Not Apply","Does Not Apply","kW/ton",0.63400000000000001,0.56000000000000005,468.68792761740599,145.51913915158866,196.6474853399848,null,null,5,5,"Does Not Apply","Does Not Apply","COP"]
[null,"WY-Water Cooled-Centrifugal-2","WY","Water Cooled","Centrifugal","≥150 tons and <300 tons",2,0.63369348246253288,0.63369348246253288,"Does Not Apply","Does Not Apply","kW/ton",0.63400000000000001,0.50700000000000001,338.7655378428837,93.841774058426779,73.891160675926599,null,null,5.55,5.55,"Does Not Apply","Does Not Apply","COP"]
[null,"WY-Water Cooled-Centrifugal-3","WY","Water Cooled","Centrifugal","≥300 tons",3,0.57655718486345209,{"$f":"12/(U31*3.412)","v":0.57655718486345209},"Does Not Apply","Does Not Apply","kW/ton",0.57599999999999996,0.46100000000000002,267.71423093494184,65.580715023103664,57.026708715742352,null,null,6.1,6.1,"Does Not Apply","Does Not Apply","COP"]
[]
[null,"Equipment ID","State","Heat Rejection","Type","Size","Size ID","Minimum COP (kW/ton)","Minimum IPLV (kW/ton)",null,null,"Unit","DEER Baseline Efficiency","DEER New Efficiency (kW/ton)","DEER Baseline cost","DEER Incremental Cost ($/ton)","($/ton/(0.1 kW/ton) increase)",null,null,"Minimum Full Load (COP)","Minimum IPLV (COP)",null,null,"Unit"]
[null,null,"California Chiller Data (Title 24 - 2008)"]
[null,"CA-Air Cooled-Reciprocating-1","CA","Air Cooled","Reciprocating","<150 tons",1,{"$f":"12/(T35*3.412)","v":1.2560710098810921},{"$f":"12/(U35*3.412)","v":1.1531143697269042},"Does Not Apply","Does Not Apply","kW/ton",1.26,1.008,448.95363636363641,39.935252525252508,{"$f":"P35/((M35-N35)/0.1)","v":15.847322430655757},null,null,2.8,3.05,"Does Not Apply","Does Not Apply","COP"]
[null,"CA-Air Cooled-Reciprocating-2","CA","Air Cooled","Reciprocating","≥150 tons and <300 tons",2,{"$f":"12/(T36*3.412)","v":1.2560710098810921},{"$f":"12/(U36*3.412)","v":1.1531143697269042},"Does Not Apply","Does Not Apply","kW/ton",1.26,1.008,448.95363636363641,39.935252525252508,15.847322430655757,null,null,2.8,3.05,"Does Not Apply","Does Not Apply","COP"]
[null,"CA-Air Cooled-Reciprocating-3","CA","Air Cooled","Reciprocating","≥300 tons",3,1.2560710098810921,1.1531143697269042,"Does Not Apply","Does Not Apply","kW/ton",1.26,1.008,448.95363636363641,39.935252525252508,15.847322430655757,null,null,2.8,3.05,"Does Not Apply","Does Not Apply","COP"]
[null,"CA-Air Cooled-Screw-1","CA","Air Cooled","Screw","<150 tons",1,1.2560710098810921,1.1531143697269042,"Does Not Apply","Does Not Apply","kW/ton",1.26,1.008,445.89673980058745,42.339587093587625,16.80142344983636,null,null,2.8,3.05,"Does Not Apply","Does Not Apply","COP"]
[null,"CA-Air Cooled-Screw-2","CA","Air Cooled","Screw","≥150 tons and <300 tons",2,1.2560710098810921,1.1531143697269042,"Does Not Apply","Does Not Apply","kW/ton",1.26,1.008,445.89673980058745,42.339587093587625,16.80142344983636,null,null,2.8,3.05,"Does Not Apply","Does Not Apply","COP"]
[null,"CA-Air Cooled-Screw-3","CA","Air Cooled","Screw","≥300 tons",3,1.2560710098810921,1.1531143697269042,"Does Not Apply","Does Not Apply","kW/ton",1.26,1.008,445.89673980058745,42.339587093587625,16.80142344983636,null,null,2.8,3.05,"Does Not Apply","Does Not Apply","COP"]
[null,"CA-Air Cooled-Scroll-1","CA","Air Cooled","Scroll","<150 tons",1,1.2560710098810921,1.1531143697269042,"Does Not Apply","Does Not Apply","kW/ton",1.26,1.008,445.89673980058745,42.339587093587625,16.80142344983636,null,null,2.8,3.05,"Does Not Apply","Does Not Apply","COP"]
[null,"CA-Air Cooled-Scroll-2","CA","Air Cooled","Scroll","≥150 tons and <300 tons",2,1.2560710098810921,1.1531143697269042,"Does Not Apply","Does Not Apply","kW/ton",1.26,1.008,445.89673980058745,42.339587093587625,16.80142344983636,null,null,2.8,3.05,"Does Not Apply","Does Not Apply","COP"]
[null,"CA-Air Cooled-Scroll-3","CA","Air Cooled","Scroll","≥300 tons",3,1.2560710098810921,1.1531143697269042,"Does Not Apply","Does Not Apply","kW/ton",1.26,1.008,445.89673980058745,42.339587093587625,16.80142344983636,null,null,2.8,3.05,"Does Not Apply","Does Not Apply","COP"]
[null,"CA-Air Cooled-Rotary-1","CA","Air Cooled","Rotary","<150 tons",1,1.2560710098810921,1.1531143697269042,"Does Not Apply","Does Not Apply","kW/ton",1.26,1.008,445.89673980058745,42.339587093587625,16.80142344983636,null,null,2.8,3.05,"Does Not Apply","Does Not Apply","COP"]
[null,{"$f":"CONCATENATE(C45,\"-\",D45,\"-\",E45,\"-\",G45)","v":"CA-Air Cooled-Rotary-2"},"CA","Air Cooled","Rotary","≥150 tons and <300 tons",2,1.2560710098810921,1.1531143697269042,"Does Not Apply","Does Not Apply","kW/ton",1.26,1.008,445.89673980058745,42.339587093587625,16.80142344983636,null,null,2.8,3.05,"Does Not Apply","Does Not Apply","COP"]
[null,"CA-Air Cooled-Rotary-3","CA","Air Cooled","Rotary","≥300 tons",3,1.2560710098810921,1.1531143697269042,"Does Not Apply","Does Not Apply","kW/ton",1.26,1.008,445.89673980058745,42.339587093587625,16.80142344983636,null,null,2.8,3.05,"Does Not Apply","Does Not Apply","COP"]
[null,"CA-Water Cooled-Reciprocating-1","CA","Water Cooled","Reciprocating","<150 tons",1,0.83738067325406129,0.69643541141921939,"Does Not Apply","Does Not Apply","kW/ton",0.83699999999999997,0.67200000000000004,462.58824239497829,16.274341238578074,9.8632371142897473,null,null,4.2,5.05,"Does Not Apply","Does Not Apply","COP"]
[null,"CA-Water Cooled-Reciprocating-2","CA","Water Cooled","Reciprocating","≥150 tons and <300 tons",2,0.83738067325406129,0.69643541141921939,"Does Not Apply","Does Not Apply","kW/ton",0.83699999999999997,0.67200000000000004,462.58824239497829,16.274341238578074,9.8632371142897473,null,null,4.2,5.05,"Does Not Apply","Does Not Apply","COP"]
[null,"CA-Water Cooled-Reciprocating-3","CA","Water Cooled","Reciprocating","≥300 tons",3,0.83738067325406129,0.69643541141921939,"Does Not Apply","Does Not Apply","kW/ton",0.83699999999999997,0.67200000000000004,462.58824239497829,16.274341238578074,9.8632371142897473,null,null,4.2,5.05,"Does Not Apply","Does Not Apply","COP"]
[null,"CA-Water Cooled-Screw-1","CA","Water Cooled","Screw","<150 tons",1,0.79033681520608023,0.67634592839751106,"Does Not Apply","Does Not Apply","kW/ton",0.79,0.63200000000000001,443.38924926972516,49.053878122290939,31.046758305247423,null,null,4.45,5.2,"Does Not Apply","Does Not Apply","COP"]
[null,"CA-Water Cooled-Screw-2","CA","Water Cooled","Screw","≥150 tons and <300 tons",2,0.71775486278919531,0.62803550494054605,"Does Not Apply","Does Not Apply","kW/ton",0.71799999999999997,0.57399999999999995,346.94119633464976,25.474144365156633,17.690378031358772,null,null,4.9000000000000004,5.6,"Does Not Apply","Does Not Apply","COP"]
[null,"CA-Water Cooled-Screw-3","CA","Water Cooled","Screw","≥300 tons",3,0.63945433230310145,0.57186972807594427,"Does Not Apply","Does Not Apply","kW/ton",0.63900000000000001,0.51100000000000001,275.83630822489715,11.398920686211682,8.9054067861028763,null,null,5.5,6.15,"Does Not Apply","Does Not Apply","COP"]
[null,"CA-Water Cooled-Scroll-1","CA","Water Cooled","Scroll","<150 tons",1,0.79033681520608023,0.67634592839751106,"Does Not Apply","Does Not Apply","kW/ton",0.79,0.63200000000000001,443.38924926972516,49.053878122290939,31.046758305247423,null,null,4.45,5.2,"Does Not Apply","Does Not Apply","COP"]
[null,"CA-Water Cooled-Scroll-2","CA","Water Cooled","Scroll","≥150 tons and <300 tons",2,0.71775486278919531,0.62803550494054605,"Does Not Apply","Does Not Apply","kW/ton",0.71799999999999997,0.57399999999999995,346.94119633464976,25.474144365156633,17.690378031358772,null,null,4.9000000000000004,5.6,"Does Not Apply","Does Not Apply","COP"]
[null,"CA-Water Cooled-Scroll-3","CA","Water Cooled","Scroll","≥300 tons",3,0.63945433230310145,0.57186972807594427,"Does Not Apply","Does Not Apply","kW/ton",0.63900000000000001,0.51100000000000001,275.83630822489715,11.398920686211682,8.9054067861028763,null,null,5.5,6.15,"Does Not Apply","Does Not Apply","COP"]
[null,"CA-Water Cooled-Rotary-1","CA","Water Cooled","Rotary","<150 tons",1,0.79033681520608023,0.67634592839751106,"Does Not Apply","Does Not Apply","kW/ton",0.79,0.63200000000000001,443.38924926972516,49.053878122290939,31.046758305247423,null,null,4.45,5.2,"Does Not Apply","Does Not Apply","COP"]
[null,"CA-Water Cooled-Rotary-2","CA","Water Cooled","Rotary","≥150 tons and <300 tons",2,0.71775486278919531,0.62803550494054605,"Does Not Apply","Does Not Apply","kW/ton",0.71799999999999997,0.57399999999999995,346.94119633464976,25.474144365156633,17.690378031358772,null,null,4.9000000000000004,5.6,"Does Not Apply","Does Not Apply","COP"]
[null,"CA-Water Cooled-Rotary-3","CA","Water Cooled","Rotary","≥300 tons",3,0.63945433230310145,0.57186972807594427,"Does Not Apply","Does Not Apply","kW/ton",0.63900000000000001,0.51100000000000001,275.83630822489715,11.398920686211682,8.9054067861028763,null,null,5.5,6.15,"Does Not Apply","Does Not Apply","COP"]
[null,"CA-Water Cooled-Centrifugal-1","CA","Water Cooled","Centrifugal","<150 tons",1,0.70339976553341155,0.66990453860324906,"Does Not Apply","Does Not Apply","kW/ton",0.63400000000000001,0.56000000000000005,468.68792761740599,145.51913915158866,196.6474853399848,null,null,5,5.25,"Does Not Apply","Does Not Apply","COP"]
[null,"CA-Water Cooled-Centrifugal-2","CA","Water Cooled","Centrifugal","≥150 tons and <300 tons",2,0.63369348246253288,0.5961014962147555,"Does Not Apply","Does Not Apply","kW/ton",0.63400000000000001,0.50700000000000001,338.7655378428837,93.841774058426779,73.891160675926599,null,null,5.55,5.9,"Does Not Apply","Does Not Apply","COP"]
[null,"CA-Water Cooled-Centrifugal-3","CA","Water Cooled","Centrifugal","≥300 tons",3,0.57655718486345209,0.5495310668229777,"Does Not Apply","Does Not Apply","kW/ton",0.57599999999999996,0.46100000000000002,267.71423093494184,65.580715023103664,57.026708715742352,null,null,6.1,6.4,"Does Not Apply","Does Not Apply","COP"]
[]
[null,"Equipment ID","State","Heat Rejection","Type","Size","Size ID","Path A Minimum Full Load (kW/ton)","Path A Minimum Part Load (kW/ton)","Path B Minimum Full Load (kW/ton)","Path B Minimum Part Load (kW/ton)","Unit","DEER Baseline Efficiency","DEER New Efficiency (kW/ton)","DEER Baseline cost","DEER Incremental Cost ($/ton)","($/ton/(0.1 kW/ton) increase)",null,null,"Path A\nMinimum Full Load (In Code)","Path A\nMinimum (In Code)","Path A\nMinimum Full Load (In Code)","Path A\nMinimum IPLV (In Code)","Unit"]
[null,null,"UTAH Chiller Data (IECC 2018)"]
[null,{"$f":"CONCATENATE(C65,\"-\",D65,\"-\",E65,\"-\",F65)","v":"UT-Air Cooled-Reciprocating-1"},"UT","Air Cooled","Reciprocating",1,"< 150 tons",{"$f":"12/T65","v":1.1881188118811881},{"$f":"12/U65","v":0.87591240875912413},{"$f":"12/V65","v":1.2371134020618557},{"$f":"12/W65","v":0.75949367088607589},"kW/ton",1.26,1.008,448.95363636363641,39.935252525252508,{"$f":"P65/((M65-N65)/0.1)","v":15.847322430655757},null,null,10.1,13.7,9.6999999999999993,15.8,"EER",null,{"$f":"IF(H65=H102,\"Same\",\"Diff\")","v":"Same"},{"$f":"IF(I65=I102,\"Same\",\"Diff\")","v":"Same"},"Same","Same"]
[null,{"$f":"CONCATENATE(C66,\"-\",D66,\"-\",E66,\"-\",F66)","v":"UT-Air Cooled-Reciprocating-2"},"UT","Air Cooled","Reciprocating",2,"≥ 150 tons",{"$f":"12/T66","v":1.1881188118811881},0.8571428571428571,1.2371134020618557,0.74534161490683226,"kW/ton",1.26,1.008,448.95363636363641,39.935252525252508,15.847322430655757,null,null,10.1,14,9.6999999999999993,16.100000000000001,"EER",null,{"$f":"IF(H66=H103,\"Same\",\"Diff\")","v":"Same"},{"$f":"IF(I66=I103,\"Same\",\"Diff\")","v":"Same"},{"$f":"IF(J66=J103,\"Same\",\"Diff\")","v":"Same"},{"$f":"IF(K66=K103,\"Same\",\"Diff\")","v":"Same"}]
[null,"UT-Air Cooled-Rotary-1","UT","Air Cooled","Rotary",1,"< 150 tons",1.1881188118811881,0.87591240875912413,1.2371134020618557,0.75949367088607589,"kW/ton",1.26,1.008,448.95363636363641,39.935252525252508,15.847322430655757,null,null,10.1,13.7,9.6999999999999993,15.8,"EER",null,"Same","Same","Same","Same"]
[null,"UT-Air Cooled-Rotary-2","UT","Air Cooled","Rotary",2,"≥ 150 tons",1.1881188118811881,0.8571428571428571,1.2371134020618557,0.74534161490683226,"kW/ton",1.26,1.008,448.95363636363641,39.935252525252508,15.847322430655757,null,null,10.1,14,9.6999999999999993,16.100000000000001,"EER",null,"Same","Same","Same","Same"]
[null,"UT-Air Cooled-Screw-1","UT","Air Cooled","Screw",1,"< 150 tons",1.1881188118811881,0.87591240875912413,1.2371134020618557,0.75949367088607589,"kW/ton",1.26,1.008,448.95363636363641,39.935252525252508,15.847322430655757,null,null,10.1,13.7,9.6999999999999993,15.8,"EER",null,"Same","Same","Same","Same"]
[null,"UT-Air Cooled-Screw-2","UT","Air Cooled","Screw",2,"≥ 150 tons",1.1881188118811881,0.8571428571428571,1.2371134020618557,0.74534161490683226,"kW/ton",1.26,1.008,448.95363636363641,39.935252525252508,15.847322430655757,null,null,10.1,14,9.6999999999999993,16.100000000000001,"EER",null,"Same","Same","Same","Same"]
[null,"UT-Air Cooled-Scroll-1","UT","Air Cooled","Scroll",1,"< 150 tons",1.1881188118811881,0.87591240875912413,1.2371134020618557,0.75949367088607589,"kW/ton",1.26,1.008,448.95363636363641,39.935252525252508,15.847322430655757,null,null,10.1,13.7,9.6999999999999993,15.8,"EER",null,"Same","Same","Same","Same"]
[null,"UT-Air Cooled-Scroll-2","UT","Air Cooled","Scroll",2,"≥ 150 tons",1.1881188118811881,0.8571428571428571,1.2371134020618557,0.74534161490683226,"kW/ton",1.26,1.008,448.95363636363641,39.935252525252508,15.847322430655757,null,null,10.1,14,9.6999999999999993,16.100000000000001,"EER",null,"Same","Same","Same","Same"]
[null,"UT-Water Cooled-Reciprocating-1","UT","Water Cooled","Reciprocating",1,"< 75 tons",{"$f":"T73","v":0.75},{"$f":"U73","v":0.6},{"$f":"V73","v":0.78},{"$f":"W73","v":0.5},"kW/ton",0.83699999999999997,0.67200000000000004,462.58824239497829,16.274341238578074,9.8632371142897473,null,null,0.75,0.6,0.78,0.5,"kW/ton",null,"Same","Same","Same","Same"]
[null,"UT-Water Cooled-Reciprocating-2","UT","Water Cooled","Reciprocating",2,"≥ 75 tons and < 150 tons",{"$f":"T74","v":0.72},0.56000000000000005,0.75,0.49,"kW/ton",0.83699999999999997,0.67200000000000004,462.58824239497829,16.274341238578074,9.8632371142897473,null,null,0.72,0.56000000000000005,0.75,0.49,"kW/ton",null,"Same","Same","Same","Same"]
[null,"UT-Water Cooled-Reciprocating-3","UT","Water Cooled","Reciprocating",3,"≥ 150 tons and < 300 tons",0.66,0.54,0.68,0.44,"kW/ton",0.83699999999999997,0.67200000000000004,462.58824239497829,16.274341238578074,9.8632371142897473,null,null,0.66,0.54,0.68,0.44,"kW/ton",null,"Same","Same","Same","Same"]
[null,"UT-Water Cooled-Reciprocating-4","UT","Water Cooled","Reciprocating",4,"≥ 300 tons and < 600 tons",0.61,0.52,0.625,0.41,"kW/ton",0.83699999999999997,0.67200000000000004,462.58824239497829,16.274341238578074,{"$f":"P76/((M76-N76)/0.1)","v":9.8632371142897473},null,null,0.61,0.52,0.625,0.41,"kW/ton",null,"Same","Same","Same","Same"]
[null,"UT-Water Cooled-Reciprocating-5","UT","Water Cooled","Reciprocating",5,"≥ 600 tons",0.56000000000000005,0.5,0.58499999999999996,0.38,"kW/ton",null,null,null,null,null,null,null,0.56000000000000005,0.5,0.58499999999999996,0.38,"kW/ton",null,"Same","Same","Same","Same"]
[null,"UT-Water Cooled-Rotary-1","UT","Water Cooled","Rotary",1,"< 75 tons",0.75,0.6,0.78,0.5,"kW/ton",0.79,0.63200000000000001,443.38924926972516,49.053878122290939,{"$f":"P78/((M78-N78)/0.1)","v":31.046758305247423},null,null,0.75,0.6,0.78,0.5,"kW/ton",null,"Same","Same","Same","Same"]
[null,"UT-Water Cooled-Rotary-2","UT","Water Cooled","Rotary",2,"≥ 75 tons and < 150 tons",0.72,0.56000000000000005,0.75,0.49,"kW/ton",0.79,0.63200000000000001,443.38924926972516,49.053878122290939,{"$f":"P79/((M79-N79)/0.1)","v":31.046758305247423},null,null,0.72,0.56000000000000005,0.75,0.49,"kW/ton",null,"Same","Same","Same","Same"]
[null,"UT-Water Cooled-Rotary-3","UT","Water Cooled","Rotary",3,"≥ 150 tons and < 300 tons",0.66,0.54,0.68,0.44,"kW/ton",0.71799999999999997,0.57399999999999995,346.94119633464976,25.474144365156633,{"$f":"P80/((M80-N80)/0.1)","v":17.690378031358772},null,null,0.66,0.54,0.68,0.44,"kW/ton",null,"Same","Same","Same","Same"]
[null,"UT-Water Cooled-Rotary-4","UT","Water Cooled","Rotary",4,"≥ 300 tons and < 600 tons",0.61,0.52,0.625,0.41,"kW/ton",0.63900000000000001,0.51100000000000001,275.83630822489715,11.398920686211682,{"$f":"P81/((M81-N81)/0.1)","v":8.9054067861028763},null,null,0.61,0.52,0.625,0.41,"kW/ton",null,"Same","Same","Same","Same"]
[null,"UT-Water Cooled-Rotary-5","UT","Water Cooled","Rotary",5,"≥ 600 tons",0.56000000000000005,0.5,0.58499999999999996,0.38,"kW/ton",null,null,null,null,null,null,null,0.56000000000000005,0.5,0.58499999999999996,0.38,null,null,"Same","Same","Same","Same"]
[null,"UT-Water Cooled-Screw-1","UT","Water Cooled","Screw",1,"< 75 tons",0.75,0.6,0.78,0.5,"kW/ton",0.79,0.63200000000000001,443.38924926972516,49.053878122290939,{"$f":"P83/((M83-N83)/0.1)","v":31.046758305247423},null,null,0.75,0.6,0.78,0.5,"kW/ton",null,"Same","Same","Same","Same"]
[null,"UT-Water Cooled-Screw-2","UT","Water Cooled","Screw",2,"≥ 75 tons and < 150 tons",0.72,0.56000000000000005,0.75,0.49,"kW/ton",0.79,0.63200000000000001,443.38924926972516,49.053878122290939,31.046758305247423,null,null,0.72,0.56000000000000005,0.75,0.49,"kW/ton",null,"Same","Same","Same","Same"]
[null,"UT-Water Cooled-Screw-3","UT","Water Cooled","Screw",3,"≥ 150 tons and < 300 tons",0.66,0.54,0.68,0.44,"kW/ton",0.71799999999999997,0.57399999999999995,346.94119633464976,25.474144365156633,17.690378031358772,null,null,0.66,0.54,0.68,0.44,"kW/ton",null,"Same","Same","Same","Same"]
[null,"UT-Water Cooled-Screw-4","UT","Water Cooled","Screw",4,"≥ 300 tons and < 600 tons",0.61,0.52,0.625,0.41,"kW/ton",0.63900000000000001,0.51100000000000001,275.83630822489715,11.398920686211682,8.9054067861028763,null,null,0.61,0.52,0.625,0.41,"kW/ton",null,"Same","Same","Same","Same"]
[null,"UT-Water Cooled-Screw-5","UT","Water Cooled","Screw",5,"≥ 600 tons",0.56000000000000005,0.5,0.58499999999999996,0.38,"kW/ton",null,null,null,null,null,null,null,0.56000000000000005,0.5,0.58499999999999996,0.38,null,null,"Same","Same","Same","Same"]
[null,"UT-Water Cooled-Scroll-1","UT","Water Cooled","Scroll",1,"< 75 tons",0.75,0.6,0.78,0.5,"kW/ton",0.79,0.63200000000000001,443.38924926972516,49.053878122290939,{"$f":"P88/((M88-N88)/0.1)","v":31.046758305247423},null,null,0.75,0.6,0.78,0.5,"kW/ton",null,"Same","Same","Same","Same"]
[null,"UT-Water Cooled-Scroll-2","UT","Water Cooled","Scroll",2,"≥ 75 tons and < 150 tons",0.72,0.56000000000000005,0.75,0.49,"kW/ton",0.79,0.63200000000000001,443.38924926972516,49.053878122290939,31.046758305247423,null,null,0.72,0.56000000000000005,0.75,0.49,"kW/ton",null,"Same","Same","Same","Same"]
[null,"UT-Water Cooled-Scroll-3","UT","Water Cooled","Scroll",3,"≥ 150 tons and < 300 tons",0.66,0.54,0.68,0.44,"kW/ton",0.71799999999999997,0.57399999999999995,346.94119633464976,25.474144365156633,17.690378031358772,null,null,0.66,0.54,0.68,0.44,"kW/ton",null,"Same","Same","Same","Same"]
[null,"UT-Water Cooled-Scroll-4","UT","Water Cooled","Scroll",4,"≥ 300 tons and < 600 tons",0.61,0.52,0.625,0.41,"kW/ton",0.63900000000000001,0.51100000000000001,275.83630822489715,11.398920686211682,8.9054067861028763,null,null,0.61,0.52,0.625,0.41,"kW/ton",null,"Same","Same","Same","Same"]
[null,"UT-Water Cooled-Scroll-5","UT","Water Cooled","Scroll",5,"≥ 600 tons",0.56000000000000005,0.5,0.58499999999999996,0.38,"kW/ton",null,null,null,null,null,null,null,0.56000000000000005,0.5,0.58499999999999996,0.38,null,null,"Same","Same","Same","Same"]
[null,"UT-Water Cooled-Centrifugal-1","UT","Water Cooled","Centrifugal",1,"< 75 tons",0.61,0.55000000000000004,0.69499999999999995,0.44,"kW/ton",0.63400000000000001,0.56000000000000005,468.68792761740599,145.51913915158866,{"$f":"P93/((M93-N93)/0.1)","v":196.6474853399848},null,null,0.61,0.55000000000000004,0.69499999999999995,0.44,"kW/ton",null,"Same","Same","Same","Same"]
[null,"UT-Water Cooled-Centrifugal-2","UT","Water Cooled","Centrifugal",2,"< 150 tons",0.61,0.55000000000000004,0.69499999999999995,0.44,"kW/ton",0.63400000000000001,0.56000000000000005,468.68792761740599,145.51913915158866,196.6474853399848,null,null,0.61,0.55000000000000004,0.69499999999999995,0.44,"kW/ton",null,"Same","Same","Same","Same"]
[null,"UT-Water Cooled-Centrifugal-3","UT","Water Cooled","Centrifugal",3,"≥ 150 tons and < 300 tons",0.61,0.55000000000000004,0.63500000000000001,0.4,"kW/ton",0.63400000000000001,0.50700000000000001,338.7655378428837,93.841774058426779,73.891160675926599,null,null,0.61,0.55000000000000004,0.63500000000000001,0.4,"kW/ton",null,"Same","Same","Same","Same"]
[null,"UT-Water Cooled-Centrifugal-4","UT","Water Cooled","Centrifugal",4,"≥ 300 tons and < 400 tons",0.56000000000000005,0.52,0.59499999999999997,0.39,"kW/ton",0.57599999999999996,0.46100000000000002,267.71423093494184,65.580715023103664,57.026708715742352,null,null,0.56000000000000005,0.52,0.59499999999999997,0.39,"kW/ton",null,"Same","Same","Same","Same"]
[null,"UT-Water Cooled-Centrifugal-5","UT","Water Cooled","Centrifugal",5,"≥ 400 tons and < 600 tons",{"$f":"T97","v":0.56000000000000005},0.5,0.58499999999999996,0.38,"kW/ton",0.57599999999999996,0.46100000000000002,267.71423093494184,65.580715023103664,57.026708715742352,null,null,0.56000000000000005,0.5,0.58499999999999996,0.38,"kW/ton",null,"Same","Same","Same","Same"]
[null,"UT-Water Cooled-Centrifugal-6","UT","Water Cooled","Centrifugal",6,"≥ 600 tons",{"$f":"T98","v":0.56000000000000005},0.5,0.58499999999999996,0.38,"kW/ton",0.57599999999999996,0.46100000000000002,267.71423093494184,65.580715023103664,57.026708715742352,null,null,0.56000000000000005,0.5,0.58499999999999996,0.38,"kW/ton"]
[]
[null,"Equipment ID","State","Heat Rejection","Type","Size","Size ID","Minimum COP (kW/ton)","Minimum IPLV (kW/ton)",null,null,"Unit","DEER Baseline Efficiency","DEER New Efficiency (kW/ton)","DEER Baseline cost","DEER Incremental Cost ($/ton)","($/ton/(0.1 kW/ton) increase)",null,null,"Path A\nMinimum Full Load","Path A\nMinimum IPLV","Path B\nMinimum Full Load","Path B\nMinimum IPLV","Unit"]
[null,null,"IDAHO Chiller Data (IECC 2015)"]
[null,{"$f":"CONCATENATE(C102,\"-\",D102,\"-\",E102,\"-\",F102)","v":"ID-Air Cooled-Reciprocating-1"},"ID","Air Cooled","Reciprocating",1,"< 150 tons",{"$f":"12/T102","v":1.1881188118811881},{"$f":"12/U102","v":0.87591240875912413},1.2371134020618557,0.75949367088607589,"kW/ton",1.26,1.008,448.95363636363641,39.935252525252508,{"$f":"P102/((M102-N102)/0.1)","v":15.847322430655757},null,null,10.1,13.7,9.6999999999999993,15.8,"EER",null,{"$f":"12/10.1","v":1.1881188118811881}]
[null,{"$f":"CONCATENATE(C103,\"-\",D103,\"-\",E103,\"-\",F103)","v":"ID-Air Cooled-Reciprocating-2"},"ID","Air Cooled","Reciprocating",2,"≥ 150 tons",{"$f":"12/T103","v":1.1881188118811881},{"$f":"12/U103","v":0.8571428571428571},{"$f":"12/V103","v":1.2371134020618557},{"$f":"12/W103","v":0.74534161490683226},"kW/ton",1.26,1.008,448.95363636363641,39.935252525252508,15.847322430655757,null,null,10.1,14,9.6999999999999993,16.100000000000001,"EER"]
[null,"ID-Air Cooled-Rotary-1","ID","Air Cooled","Rotary",1,"< 150 tons",1.1881188118811881,0.87591240875912413,1.2371134020618557,0.75949367088607589,"kW/ton",1.26,1.008,448.95363636363641,39.935252525252508,15.847322430655757,null,null,10.1,13.7,9.6999999999999993,15.8,"EER"]
[null,"ID-Air Cooled-Rotary-2","ID","Air Cooled","Rotary",2,"≥ 150 tons",1.1881188118811881,0.8571428571428571,1.2371134020618557,0.74534161490683226,"kW/ton",1.26,1.008,448.95363636363641,39.935252525252508,15.847322430655757,null,null,10.1,14,9.6999999999999993,16.100000000000001,"EER"]
[null,"ID-Air Cooled-Screw-1","ID","Air Cooled","Screw",1,"< 150 tons",1.1881188118811881,0.87591240875912413,1.2371134020618557,0.75949367088607589,"kW/ton",1.26,1.008,448.95363636363641,39.935252525252508,15.847322430655757,null,null,10.1,13.7,9.6999999999999993,15.8,"EER"]
[null,"ID-Air Cooled-Screw-2","ID","Air Cooled","Screw",2,"≥ 150 tons",1.1881188118811881,0.8571428571428571,1.2371134020618557,0.74534161490683226,"kW/ton",1.26,1.008,448.95363636363641,39.935252525252508,15.847322430655757,null,null,10.1,14,9.6999999999999993,16.100000000000001,"EER"]
[null,"ID-Air Cooled-Scroll-1","ID","Air Cooled","Scroll",1,"< 150 tons",1.1881188118811881,0.87591240875912413,1.2371134020618557,0.75949367088607589,"kW/ton",1.26,1.008,448.95363636363641,39.935252525252508,15.847322430655757,null,null,10.1,13.7,9.6999999999999993,15.8,"EER"]
[null,"ID-Air Cooled-Scroll-2","ID","Air Cooled","Scroll",2,"≥ 150 tons",1.1881188118811881,0.8571428571428571,1.2371134020618557,0.74534161490683226,"kW/ton",1.26,1.008,448.95363636363641,39.935252525252508,15.847322430655757,null,null,10.1,14,9.6999999999999993,16.100000000000001,"EER"]
[null,"ID-Water Cooled-Reciprocating-1","ID","Water Cooled","Reciprocating",1,"< 75 tons",{"$f":"T110","v":0.75},{"$f":"U110","v":0.6},0.78,0.5,"kW/ton",0.83699999999999997,0.67200000000000004,462.58824239497829,16.274341238578074,9.8632371142897473,null,null,0.75,0.6,0.78,0.5,"kW/ton"]
[null,"ID-Water Cooled-Reciprocating-2","ID","Water Cooled","Reciprocating",2,"≥ 75 tons and < 150 tons",{"$f":"T111","v":0.72},{"$f":"U111","v":0.56000000000000005},{"$f":"V111","v":0.75},{"$f":"W111","v":0.49},"kW/ton",0.83699999999999997,0.67200000000000004,462.58824239497829,16.274341238578074,9.8632371142897473,null,null,0.72,0.56000000000000005,0.75,0.49,"kW/ton"]
[null,"ID-Water Cooled-Reciprocating-3","ID","Water Cooled","Reciprocating",3,"≥ 150 tons and < 300 tons",0.66,0.54,0.68,0.44,"kW/ton",0.83699999999999997,0.67200000000000004,462.58824239497829,16.274341238578074,9.8632371142897473,null,null,0.66,0.54,0.68,0.44,"kW/ton"]
[null,"ID-Water Cooled-Reciprocating-4","ID","Water Cooled","Reciprocating",4,"≥ 300 tons and < 600 tons",0.61,0.52,0.625,0.41,"kW/ton",0.83699999999999997,0.67200000000000004,462.58824239497829,16.274341238578074,{"$f":"P113/((M113-N113)/0.1)","v":9.8632371142897473},null,null,0.61,0.52,0.625,0.41,"kW/ton"]
[null,"ID-Water Cooled-Reciprocating-5","ID","Water Cooled","Reciprocating",5,"≥ 600 tons",0.56000000000000005,0.5,0.58499999999999996,0.38,"kW/ton",null,null,null,null,null,null,null,0.56000000000000005,0.5,0.58499999999999996,0.38,"kW/ton"]
[null,"ID-Water Cooled-Rotary-1","ID","Water Cooled","Rotary",1,"< 75 tons",0.75,0.6,0.78,0.5,"kW/ton",0.79,0.63200000000000001,443.38924926972516,49.053878122290939,{"$f":"P115/((M115-N115)/0.1)","v":31.046758305247423},null,null,0.75,0.6,0.78,0.5,"kW/ton"]
[null,"ID-Water Cooled-Rotary-2","ID","Water Cooled","Rotary",2,"≥ 75 tons and < 150 tons",0.72,0.56000000000000005,0.75,0.49,"kW/ton",0.79,0.63200000000000001,443.38924926972516,49.053878122290939,{"$f":"P116/((M116-N116)/0.1)","v":31.046758305247423},null,null,0.72,0.56000000000000005,0.75,0.49,"kW/ton"]
[null,"ID-Water Cooled-Rotary-3","ID","Water Cooled","Rotary",3,"≥ 150 tons and < 300 tons",0.66,0.54,0.68,0.44,"kW/ton",0.71799999999999997,0.57399999999999995,346.94119633464976,25.474144365156633,{"$f":"P117/((M117-N117)/0.1)","v":17.690378031358772},null,null,0.66,0.54,0.68,0.44,"kW/ton"]
[null,"ID-Water Cooled-Rotary-4","ID","Water Cooled","Rotary",4,"≥ 300 tons and < 600 tons",0.61,0.52,0.625,0.41,"kW/ton",0.63900000000000001,0.51100000000000001,275.83630822489715,11.398920686211682,{"$f":"P118/((M118-N118)/0.1)","v":8.9054067861028763},null,null,0.61,0.52,0.625,0.41,"kW/ton"]
[null,{"$f":"CONCATENATE(C119,\"-\",D119,\"-\",E119,\"-\",F119)","v":"ID-Water Cooled-Rotary-5"},"ID","Water Cooled","Rotary",5,"≥ 600 tons",0.56000000000000005,0.5,0.58499999999999996,0.38,"kW/ton",null,null,null,null,null,null,null,0.56000000000000005,0.5,0.58499999999999996,0.38,"kW/ton"]
[null,"ID-Water Cooled-Screw-1","ID","Water Cooled","Screw",1,"< 75 tons",0.75,0.6,0.78,0.5,"kW/ton",0.79,0.63200000000000001,443.38924926972516,49.053878122290939,{"$f":"P120/((M120-N120)/0.1)","v":31.046758305247423},null,null,0.75,0.6,0.78,0.5,"kW/ton"]
[null,"ID-Water Cooled-Screw-2","ID","Water Cooled","Screw",2,"≥ 75 tons and < 150 tons",0.72,0.56000000000000005,0.75,0.49,"kW/ton",0.79,0.63200000000000001,443.38924926972516,49.053878122290939,31.046758305247423,null,null,0.72,0.56000000000000005,0.75,0.49,"kW/ton"]
[null,"ID-Water Cooled-Screw-3","ID","Water Cooled","Screw",3,"≥ 150 tons and < 300 tons",0.66,0.54,0.68,0.44,"kW/ton",0.71799999999999997,0.57399999999999995,346.94119633464976,25.474144365156633,17.690378031358772,null,null,0.66,0.54,0.68,0.44,"kW/ton"]
[null,"ID-Water Cooled-Screw-4","ID","Water Cooled","Screw",4,"≥ 300 tons and < 600 tons",0.61,0.52,0.625,0.41,"kW/ton",0.63900000000000001,0.51100000000000001,275.83630822489715,11.398920686211682,8.9054067861028763,null,null,0.61,0.52,0.625,0.41,"kW/ton"]
[null,{"$f":"CONCATENATE(C124,\"-\",D124,\"-\",E124,\"-\",F124)","v":"ID-Water Cooled-Screw-5"},"ID","Water Cooled","Screw",5,"≥ 600 tons",0.56000000000000005,0.5,0.58499999999999996,0.38,"kW/ton",null,null,null,null,null,null,null,0.56000000000000005,0.5,0.58499999999999996,0.38,"kW/ton"]
[null,"ID-Water Cooled-Scroll-1","ID","Water Cooled","Scroll",1,"< 75 tons",0.75,0.6,0.78,0.5,"kW/ton",0.79,0.63200000000000001,443.38924926972516,49.053878122290939,31.046758305247423,null,null,0.75,0.6,0.78,0.5,"kW/ton"]
[null,"ID-Water Cooled-Scroll-2","ID","Water Cooled","Scroll",2,"≥ 75 tons and < 150 tons",0.72,0.56000000000000005,0.75,0.49,"kW/ton",0.79,0.63200000000000001,443.38924926972516,49.053878122290939,31.046758305247423,null,null,0.72,0.56000000000000005,0.75,0.49,"kW/ton"]
[null,"ID-Water Cooled-Scroll-3","ID","Water Cooled","Scroll",3,"≥ 150 tons and < 300 tons",0.66,0.54,0.68,0.44,"kW/ton",0.71799999999999997,0.57399999999999995,346.94119633464976,25.474144365156633,17.690378031358772,null,null,0.66,0.54,0.68,0.44,"kW/ton"]
[null,"ID-Water Cooled-Scroll-4","ID","Water Cooled","Scroll",4,"≥ 300 tons and < 600 tons",0.61,0.52,0.625,0.41,"kW/ton",0.63900000000000001,0.51100000000000001,275.83630822489715,11.398920686211682,8.9054067861028763,null,null,0.61,0.52,0.625,0.41,"kW/ton"]
[null,{"$f":"CONCATENATE(C129,\"-\",D129,\"-\",E129,\"-\",F129)","v":"ID-Water Cooled-Scroll-5"},"ID","Water Cooled","Scroll",5,"≥ 600 tons",0.56000000000000005,0.5,0.58499999999999996,0.38,"kW/ton",null,null,null,null,null,null,null,0.56000000000000005,0.5,0.58499999999999996,0.38,"kW/ton"]
[null,"ID-Water Cooled-Centrifugal-1","ID","Water Cooled","Centrifugal",1,"< 75 tons",0.61,0.55000000000000004,0.69499999999999995,0.44,"kW/ton",0.63400000000000001,0.56000000000000005,468.68792761740599,145.51913915158866,196.6474853399848,null,null,0.61,0.55000000000000004,0.69499999999999995,0.44,"kW/ton"]
[null,{"$f":"CONCATENATE(C131,\"-\",D131,\"-\",E131,\"-\",F131)","v":"ID-Water Cooled-Centrifugal-2"},"ID","Water Cooled","Centrifugal",2,"< 150 tons",0.61,0.55000000000000004,0.69499999999999995,0.44,"kW/ton",0.63400000000000001,0.56000000000000005,468.68792761740599,145.51913915158866,196.6474853399848,null,null,0.61,0.55000000000000004,0.69499999999999995,0.44,"kW/ton"]
[null,"ID-Water Cooled-Centrifugal-3","ID","Water Cooled","Centrifugal",3,"≥ 150 tons and < 300 tons",0.61,0.55000000000000004,0.63500000000000001,0.4,"kW/ton",0.63400000000000001,0.50700000000000001,338.7655378428837,93.841774058426779,73.891160675926599,null,null,0.61,0.55000000000000004,0.63500000000000001,0.4,"kW/ton"]
[null,"ID-Water Cooled-Centrifugal-4","ID","Water Cooled","Centrifugal",4,"≥ 300 tons and < 400 tons",0.56000000000000005,0.52,0.59499999999999997,0.39,"kW/ton",0.57599999999999996,0.46100000000000002,267.71423093494184,65.580715023103664,57.026708715742352,null,null,0.56000000000000005,0.52,0.59499999999999997,0.39,"kW/ton"]
[null,{"$f":"CONCATENATE(C134,\"-\",D134,\"-\",E134,\"-\",F134)","v":"ID-Water Cooled-Centrifugal-5"},"ID","Water Cooled","Centrifugal",5,"≥ 400 tons and < 600 tons",{"$f":"T134","v":0.56000000000000005},{"$f":"U134","v":0.5},{"$f":"V134","v":0.58499999999999996},{"$f":"W134","v":0.38},"kW/ton",0.57599999999999996,0.46100000000000002,267.71423093494184,65.580715023103664,{"$f":"P134/((M134-N134)/0.1)","v":57.026708715742352},null,null,0.56000000000000005,0.5,0.58499999999999996,0.38,"kW/ton"]
[null,"ID-Water Cooled-Centrifugal-6","ID","Water Cooled","Centrifugal",6,"≥ 600 tons",{"$f":"T135","v":0.56000000000000005},0.5,0.58499999999999996,0.38,"kW/ton",0.57599999999999996,0.46100000000000002,267.71423093494184,65.580715023103664,57.026708715742352,null,null,0.56000000000000005,0.5,0.58499999999999996,0.38,"kW/ton"]
[]
[null,"Equipment ID","State","Heat Rejection","Type","Size","Size ID","Minimum COP (kW/ton)","Minimum IPLV (kW/ton)",null,null,"Unit","DEER Baseline Efficiency","DEER New Efficiency (kW/ton)","DEER Baseline cost","DEER Incremental Cost ($/ton)","($/ton/(0.1 kW/ton) increase)",null,null,"Path A\nMinimum Full Load (In Code)","Path A\nMinimum (In Code)","Path A\nMinimum Full Load (In Code)","Path A\nMinimum IPLV (In Code)","Unit"]
[null,null,"Washington Chiller Data (WSEC 2021) -eff March 15, 2024"]
[null,"WA-Air Cooled-Reciprocating-A","WA","Air Cooled","Reciprocating","A","< 150 tons",{"$f":"12/T139","v":1.1881188118811881},{"$f":"12/U139","v":0.87591240875912413},{"$f":"12/V139","v":1.2371134020618557},{"$f":"12/W139","v":0.75949367088607589},"kW/ton",null,null,null,null,null,null,null,10.1,13.7,9.6999999999999993,15.8,"EER"]
[null,"WA-Air Cooled-Reciprocating-B","WA","Air Cooled","Reciprocating","B","≥ 150 tons",{"$f":"12/T140","v":1.1881188118811881},0.8571428571428571,1.2371134020618557,0.74534161490683226,"kW/ton",null,null,null,null,null,null,null,10.1,14,9.6999999999999993,16.100000000000001,"EER"]
[null,"WA-Air Cooled-Rotary-A","WA","Air Cooled","Rotary","A","< 150 tons",1.1881188118811881,0.87591240875912413,1.2371134020618557,0.75949367088607589,"kW/ton",null,null,null,null,null,null,null,10.1,13.7,9.6999999999999993,15.8,"EER"]
[null,"WA-Air Cooled-Rotary-B","WA","Air Cooled","Rotary","B","≥ 150 tons",1.1881188118811881,0.8571428571428571,1.2371134020618557,0.74534161490683226,"kW/ton",null,null,null,null,null,null,null,10.1,14,9.6999999999999993,16.100000000000001,"EER"]
[null,"WA-Air Cooled-Screw-A","WA","Air Cooled","Screw","A","< 150 tons",1.1881188118811881,0.87591240875912413,1.2371134020618557,0.75949367088607589,"kW/ton",null,null,null,null,null,null,null,10.1,13.7,9.6999999999999993,15.8,"EER"]
[null,"WA-Air Cooled-Screw-B","WA","Air Cooled","Screw","B","≥ 150 tons",1.1881188118811881,0.8571428571428571,1.2371134020618557,0.74534161490683226,"kW/ton",null,null,null,null,null,null,null,10.1,14,9.6999999999999993,16.100000000000001,"EER"]
[null,"WA-Air Cooled-Scroll-A","WA","Air Cooled","Scroll","A","< 150 tons",1.1881188118811881,0.87591240875912413,1.2371134020618557,0.75949367088607589,"kW/ton",null,null,null,null,null,null,null,10.1,13.7,9.6999999999999993,15.8,"EER"]
[null,"WA-Air Cooled-Scroll-B","WA","Air Cooled","Scroll","B","≥ 150 tons",1.1881188118811881,0.8571428571428571,1.2371134020618557,0.74534161490683226,"kW/ton",null,null,null,null,null,null,null,10.1,14,9.6999999999999993,16.100000000000001,"EER"]
[null,"WA-Water Cooled-Reciprocating-A","WA","Water Cooled","Reciprocating","A","< 75 tons",{"$f":"T147","v":0.75},{"$f":"U147","v":0.6},{"$f":"V147","v":0.78},{"$f":"W147","v":0.5},"kW/ton",null,null,null,null,null,null,null,0.75,0.6,0.78,0.5,"kW/ton"]
[null,"WA-Water Cooled-Reciprocating-B","WA","Water Cooled","Reciprocating","B","≥ 75 tons and < 150 tons",{"$f":"T148","v":0.72},{"$f":"U148","v":0.56000000000000005},{"$f":"V148","v":0.75},{"$f":"W148","v":0.49},"kW/ton",null,null,null,null,null,null,null,0.72,0.56000000000000005,0.75,0.49,"kW/ton"]
[null,"WA-Water Cooled-Reciprocating-C","WA","Water Cooled","Reciprocating","C","≥ 150 tons and < 300 tons",0.66,0.54,0.68,0.44,"kW/ton",null,null,null,null,null,null,null,0.66,0.54,0.68,0.44,"kW/ton"]
[null,"WA-Water Cooled-Reciprocating-D","WA","Water Cooled","Reciprocating","D","≥ 300 tons and < 600 tons",0.61,0.52,0.625,0.41,"kW/ton",null,null,null,null,null,null,null,0.61,0.52,0.625,0.41,"kW/ton"]
[null,{"$f":"CONCATENATE(C151,\"-\",D151,\"-\",E151,\"-\",F151)","v":"WA-Water Cooled-Reciprocating-E"},"WA","Water Cooled","Reciprocating","E","≥ 600 tons",0.56000000000000005,0.5,0.58499999999999996,0.38,"kW/ton",null,null,null,null,null,null,null,0.56000000000000005,0.5,0.58499999999999996,0.38,"kW/ton"]
[null,"WA-Water Cooled-Rotary-A","WA","Water Cooled","Rotary","A","< 75 tons",0.75,0.6,0.78,0.5,"kW/ton",null,null,null,null,null,null,null,0.75,0.6,0.78,0.5]
[null,"WA-Water Cooled-Rotary-B","WA","Water Cooled","Rotary","B","≥ 75 tons and < 150 tons",0.72,0.56000000000000005,0.75,0.49,"kW/ton",null,null,null,null,null,null,null,0.72,0.56000000000000005,0.75,0.49]
[null,"WA-Water Cooled-Rotary-C","WA","Water Cooled","Rotary","C","≥ 150 tons and < 300 tons",0.66,0.54,0.68,0.44,"kW/ton",null,null,null,null,null,null,null,0.66,0.54,0.68,0.44]
[null,"WA-Water Cooled-Rotary-D","WA","Water Cooled","Rotary","D","≥ 300 tons and < 600 tons",0.61,0.52,0.625,0.41,"kW/ton",null,null,null,null,null,null,null,0.61,0.52,0.625,0.41]
[null,"WA-Water Cooled-Rotary-E","WA","Water Cooled","Rotary","E","≥ 600 tons",0.56000000000000005,0.5,0.58499999999999996,0.38,"kW/ton",null,null,null,null,null,null,null,0.56000000000000005,0.5,0.58499999999999996,0.38]
[null,"WA-Water Cooled-Screw-A","WA","Water Cooled","Screw","A","< 75 tons",0.75,0.6,0.78,0.5,"kW/ton",null,null,null,null,null,null,null,0.75,0.6,0.78,0.5,"kW/ton"]
[null,"WA-Water Cooled-Screw-B","WA","Water Cooled","Screw","B","≥ 75 tons and < 150 tons",0.72,0.56000000000000005,0.75,0.49,"kW/ton",null,null,null,null,null,null,null,0.72,0.56000000000000005,0.75,0.49,"kW/ton"]
[null,"WA-Water Cooled-Screw-C","WA","Water Cooled","Screw","C","≥ 150 tons and < 300 tons",0.66,0.54,0.68,0.44,"kW/ton",null,null,null,null,null,null,null,0.66,0.54,0.68,0.44,"kW/ton"]
[null,"WA-Water Cooled-Screw-D","WA","Water Cooled","Screw","D","≥ 300 tons and < 600 tons",0.61,0.52,0.625,0.41,"kW/ton",null,null,null,null,null,null,null,0.61,0.52,0.625,0.41,"kW/ton"]
[null,"WA-Water Cooled-Screw-E","WA","Water Cooled","Screw","E","≥ 600 tons",0.56000000000000005,0.5,0.58499999999999996,0.38,"kW/ton",null,null,null,null,null,null,null,0.56000000000000005,0.5,0.58499999999999996,0.38,"kW/ton"]
[null,"WA-Water Cooled-Scroll-A","WA","Water Cooled","Scroll","A","< 75 tons",0.75,0.6,0.78,0.5,"kW/ton",null,null,null,null,null,null,null,0.75,0.6,0.78,0.5,"kW/ton"]
[null,"WA-Water Cooled-Scroll-B","WA","Water Cooled","Scroll","B","≥ 75 tons and < 150 tons",0.72,0.56000000000000005,0.75,0.49,"kW/ton",null,null,null,null,null,null,null,0.72,0.56000000000000005,0.75,0.49,"kW/ton"]
[null,"WA-Water Cooled-Scroll-C","WA","Water Cooled","Scroll","C","≥ 150 tons and < 300 tons",0.66,0.54,0.68,0.44,"kW/ton",null,null,null,null,null,null,null,0.66,0.54,0.68,0.44,"kW/ton"]
[null,"WA-Water Cooled-Scroll-D","WA","Water Cooled","Scroll","D","≥ 300 tons and < 600 tons",0.61,0.52,0.625,0.41,"kW/ton",null,null,null,null,null,null,null,0.61,0.52,0.625,0.41,"kW/ton"]
[null,"WA-Water Cooled-Scroll-E","WA","Water Cooled","Scroll","E","≥ 600 tons",0.56000000000000005,0.5,0.58499999999999996,0.38,"kW/ton",null,null,null,null,null,null,null,0.56000000000000005,0.5,0.58499999999999996,0.38,"kW/ton"]
[null,"WA-Water Cooled-Centrifugal-A","WA","Water Cooled","Centrifugal","A","< 75 tons",0.61,0.55000000000000004,0.69499999999999995,0.4,"kW/ton",null,null,null,null,null,null,null,0.61,0.55000000000000004,0.69499999999999995,0.4,"kW/ton"]
[null,"WA-Water Cooled-Centrifugal-B","WA","Water Cooled","Centrifugal","B","< 150 tons",0.61,0.55000000000000004,0.69499999999999995,0.4,"kW/ton",null,null,null,null,null,null,null,0.61,0.55000000000000004,0.69499999999999995,0.4,"kW/ton"]
[null,"WA-Water Cooled-Centrifugal-C","WA","Water Cooled","Centrifugal","C","≥ 150 tons and < 300 tons",0.61,0.55000000000000004,0.69499999999999995,0.4,"kW/ton",null,null,null,null,null,null,null,0.61,0.55000000000000004,0.69499999999999995,0.4,"kW/ton"]
[null,"WA-Water Cooled-Centrifugal-D","WA","Water Cooled","Centrifugal","D","≥ 300 tons and < 400 tons",0.56000000000000005,0.52,0.59499999999999997,0.39,"kW/ton",null,null,null,null,null,null,null,0.56000000000000005,0.52,0.59499999999999997,0.39,"kW/ton"]
[null,"WA-Water Cooled-Centrifugal-E","WA","Water Cooled","Centrifugal","E","≥ 400 tons and < 600 tons",0.56000000000000005,0.5,0.58499999999999996,0.38,"kW/ton",null,null,null,null,null,null,null,0.56000000000000005,0.5,0.58499999999999996,0.38,"kW/ton"]
[null,"WA-Water Cooled-Centrifugal-F","WA","Water Cooled","Centrifugal","F","≥ 600 tons",0.56000000000000005,0.5,0.58499999999999996,0.38,"kW/ton",null,null,null,null,null,null,null,0.56000000000000005,0.5,0.58499999999999996,0.38,"kW/ton"]
[]
[null,"Equipment ID","State","Heat Rejection","Type","Size","Size ID","Minimum COP (kW/ton)","Minimum IPLV (kW/ton)",null,null,"Unit","DEER Baseline Efficiency","DEER New Efficiency (kW/ton)","DEER Baseline cost","DEER Incremental Cost ($/ton)","($/ton/(0.1 kW/ton) increase)",null,null,"Minimum Full Load (COP)","Minimum IPLV (COP)",null,null,"Unit"]
[null,null,"UTAH Chiller Data (IECC 2021) - Effective July 1, 2023"]
[null,{"$f":"CONCATENATE(C176,\"-\",D176,\"-\",E176,\"-\",F176)","v":"UT-Air Cooled-Reciprocating-A"},"UT","Air Cooled","Reciprocating","A","< 150 tons",{"$f":"12/T176","v":1.1881188118811881},{"$f":"12/U176","v":0.87591240875912413},{"$f":"12/V176","v":1.2371134020618557},{"$f":"12/W176","v":0.75949367088607589},"kW/ton",1.26,1.008,448.95363636363641,39.935252525252508,{"$f":"P176/((M176-N176)/0.1)","v":15.847322430655757},null,null,10.1,13.7,9.6999999999999993,15.8,"EER",null,{"$f":"IF(H176=H65,\"Same\",\"Diff\")","v":"Same"},{"$f":"IF(I176=I65,\"Same\",\"Diff\")","v":"Same"},"Same","Same"]
[null,{"$f":"CONCATENATE(C177,\"-\",D177,\"-\",E177,\"-\",F177)","v":"UT-Air Cooled-Reciprocating-B"},"UT","Air Cooled","Reciprocating","B","≥ 150 tons",{"$f":"12/T177","v":1.1881188118811881},0.8571428571428571,1.2371134020618557,0.74534161490683226,"kW/ton",1.26,1.008,448.95363636363641,39.935252525252508,15.847322430655757,null,null,10.1,14,9.6999999999999993,16.100000000000001,"EER",null,"Same",{"$f":"IF(I177=I66,\"Same\",\"Diff\")","v":"Same"},{"$f":"IF(J177=J66,\"Same\",\"Diff\")","v":"Same"},{"$f":"IF(K177=K66,\"Same\",\"Diff\")","v":"Same"}]
[null,"UT-Air Cooled-Rotary-A","UT","Air Cooled","Rotary","A","< 150 tons",1.1881188118811881,0.87591240875912413,1.2371134020618557,0.75949367088607589,"kW/ton",1.26,1.008,448.95363636363641,39.935252525252508,15.847322430655757,null,null,10.1,13.7,9.6999999999999993,15.8,"EER",null,"Same","Same","Same","Same"]
[null,"UT-Air Cooled-Rotary-B","UT","Air Cooled","Rotary","B","≥ 150 tons",1.1881188118811881,0.8571428571428571,1.2371134020618557,0.74534161490683226,"kW/ton",1.26,1.008,448.95363636363641,39.935252525252508,15.847322430655757,null,null,10.1,14,9.6999999999999993,16.100000000000001,"EER",null,"Same","Same","Same","Same"]
[null,"UT-Air Cooled-Screw-A","UT","Air Cooled","Screw","A","< 150 tons",1.1881188118811881,0.87591240875912413,1.2371134020618557,0.75949367088607589,"kW/ton",1.26,1.008,448.95363636363641,39.935252525252508,15.847322430655757,null,null,10.1,13.7,9.6999999999999993,15.8,"EER",null,"Same","Same","Same","Same"]
[null,"UT-Air Cooled-Screw-B","UT","Air Cooled","Screw","B","≥ 150 tons",1.1881188118811881,0.8571428571428571,1.2371134020618557,0.74534161490683226,"kW/ton",1.26,1.008,448.95363636363641,39.935252525252508,15.847322430655757,null,null,10.1,14,9.6999999999999993,16.100000000000001,"EER",null,"Same","Same","Same","Same"]
[null,"UT-Air Cooled-Scroll-A","UT","Air Cooled","Scroll","A","< 150 tons",1.1881188118811881,0.87591240875912413,1.2371134020618557,0.75949367088607589,"kW/ton",1.26,1.008,448.95363636363641,39.935252525252508,15.847322430655757,null,null,10.1,13.7,9.6999999999999993,15.8,"EER",null,"Same","Same","Same","Same"]
[null,"UT-Air Cooled-Scroll-B","UT","Air Cooled","Scroll","B","≥ 150 tons",1.1881188118811881,0.8571428571428571,1.2371134020618557,0.74534161490683226,"kW/ton",1.26,1.008,448.95363636363641,39.935252525252508,15.847322430655757,null,null,10.1,14,9.6999999999999993,16.100000000000001,"EER",null,"Same","Same","Same","Same"]
[null,"UT-Water Cooled-Reciprocating-A","UT","Water Cooled","Reciprocating","A","< 75 tons",{"$f":"T184","v":0.75},{"$f":"U184","v":0.6},{"$f":"V184","v":0.78},{"$f":"W184","v":0.5},"kW/ton",0.83699999999999997,0.67200000000000004,462.58824239497829,16.274341238578074,9.8632371142897473,null,null,0.75,0.6,0.78,0.5,"kW/ton",null,"Same","Same","Same","Same"]
[null,"UT-Water Cooled-Reciprocating-B","UT","Water Cooled","Reciprocating","B","≥ 75 tons and < 150 tons",{"$f":"T185","v":0.72},0.56000000000000005,0.75,0.49,"kW/ton",0.83699999999999997,0.67200000000000004,462.58824239497829,16.274341238578074,9.8632371142897473,null,null,0.72,0.56000000000000005,0.75,0.49,"kW/ton",null,"Same","Same","Same","Same"]
[null,"UT-Water Cooled-Reciprocating-C","UT","Water Cooled","Reciprocating","C","≥ 150 tons and < 300 tons",0.66,0.54,0.68,0.44,"kW/ton",0.83699999999999997,0.67200000000000004,462.58824239497829,16.274341238578074,9.8632371142897473,null,null,0.66,0.54,0.68,0.44,"kW/ton",null,"Same","Same","Same","Same"]
[null,"UT-Water Cooled-Reciprocating-D","UT","Water Cooled","Reciprocating","D","≥ 300 tons and < 600 tons",0.61,0.52,0.625,0.41,"kW/ton",0.83699999999999997,0.67200000000000004,462.58824239497829,16.274341238578074,{"$f":"P187/((M187-N187)/0.1)","v":9.8632371142897473},null,null,0.61,0.52,0.625,0.41,"kW/ton",null,"Same","Same","Same","Same"]
[null,"UT-Water Cooled-Reciprocating-E","UT","Water Cooled","Reciprocating","E","≥ 600 tons",0.56000000000000005,0.5,0.58499999999999996,0.38,"kW/ton",null,null,null,null,null,null,null,0.56000000000000005,0.5,0.58499999999999996,0.38,"kW/ton",null,"Same","Same","Same","Same"]
[null,"UT-Water Cooled-Rotary-A","UT","Water Cooled","Rotary","A","< 75 tons",0.75,0.6,0.78,0.5,"kW/ton",0.79,0.63200000000000001,443.38924926972516,49.053878122290939,{"$f":"P189/((M189-N189)/0.1)","v":31.046758305247423},null,null,0.75,0.6,0.78,0.5,"kW/ton",null,"Same","Same","Same","Same"]
[null,"UT-Water Cooled-Rotary-B","UT","Water Cooled","Rotary","B","≥ 75 tons and < 150 tons",0.72,0.56000000000000005,0.75,0.49,"kW/ton",0.79,0.63200000000000001,443.38924926972516,49.053878122290939,{"$f":"P190/((M190-N190)/0.1)","v":31.046758305247423},null,null,0.72,0.56000000000000005,0.75,0.49,"kW/ton",null,"Same","Same","Same","Same"]
[null,"UT-Water Cooled-Rotary-C","UT","Water Cooled","Rotary","C","≥ 150 tons and < 300 tons",0.66,0.54,0.68,0.44,"kW/ton",0.71799999999999997,0.57399999999999995,346.94119633464976,25.474144365156633,{"$f":"P191/((M191-N191)/0.1)","v":17.690378031358772},null,null,0.66,0.54,0.68,0.44,"kW/ton",null,"Same","Same","Same","Same"]
[null,"UT-Water Cooled-Rotary-D","UT","Water Cooled","Rotary","D","≥ 300 tons and < 600 tons",0.61,0.52,0.625,0.41,"kW/ton",0.63900000000000001,0.51100000000000001,275.83630822489715,11.398920686211682,{"$f":"P192/((M192-N192)/0.1)","v":8.9054067861028763},null,null,0.61,0.52,0.625,0.41,"kW/ton",null,"Same","Same","Same","Same"]
[null,"UT-Water Cooled-Rotary-E","UT","Water Cooled","Rotary","E","≥ 600 tons",0.56000000000000005,0.5,0.58499999999999996,0.38,"kW/ton",null,null,null,null,null,null,null,0.56000000000000005,0.5,0.58499999999999996,0.38,null,null,"Same","Same","Same","Same"]
[null,"UT-Water Cooled-Screw-A","UT","Water Cooled","Screw","A","< 75 tons",0.75,0.6,0.78,0.5,"kW/ton",0.79,0.63200000000000001,443.38924926972516,49.053878122290939,{"$f":"P194/((M194-N194)/0.1)","v":31.046758305247423},null,null,0.75,0.6,0.78,0.5,"kW/ton",null,"Same","Same","Same","Same"]
[null,"UT-Water Cooled-Screw-B","UT","Water Cooled","Screw","B","≥ 75 tons and < 150 tons",0.72,0.56000000000000005,0.75,0.49,"kW/ton",0.79,0.63200000000000001,443.38924926972516,49.053878122290939,31.046758305247423,null,null,0.72,0.56000000000000005,0.75,0.49,"kW/ton",null,"Same","Same","Same","Same"]
[null,"UT-Water Cooled-Screw-C","UT","Water Cooled","Screw","C","≥ 150 tons and < 300 tons",0.66,0.54,0.68,0.44,"kW/ton",0.71799999999999997,0.57399999999999995,346.94119633464976,25.474144365156633,17.690378031358772,null,null,0.66,0.54,0.68,0.44,"kW/ton",null,"Same","Same","Same","Same"]
[null,"UT-Water Cooled-Screw-D","UT","Water Cooled","Screw","D","≥ 300 tons and < 600 tons",0.61,0.52,0.625,0.41,"kW/ton",0.63900000000000001,0.51100000000000001,275.83630822489715,11.398920686211682,8.9054067861028763,null,null,0.61,0.52,0.625,0.41,"kW/ton",null,"Same","Same","Same","Same"]
[null,"UT-Water Cooled-Screw-E","UT","Water Cooled","Screw","E","≥ 600 tons",0.56000000000000005,0.5,0.58499999999999996,0.38,"kW/ton",null,null,null,null,null,null,null,0.56000000000000005,0.5,0.58499999999999996,0.38,null,null,"Same","Same","Same","Same"]
[null,"UT-Water Cooled-Scroll-A","UT","Water Cooled","Scroll","A","< 75 tons",0.75,0.6,0.78,0.5,"kW/ton",0.79,0.63200000000000001,443.38924926972516,49.053878122290939,{"$f":"P199/((M199-N199)/0.1)","v":31.046758305247423},null,null,0.75,0.6,0.78,0.5,"kW/ton",null,"Same","Same","Same","Same"]
[null,"UT-Water Cooled-Scroll-B","UT","Water Cooled","Scroll","B","≥ 75 tons and < 150 tons",0.72,0.56000000000000005,0.75,0.49,"kW/ton",0.79,0.63200000000000001,443.38924926972516,49.053878122290939,31.046758305247423,null,null,0.72,0.56000000000000005,0.75,0.49,"kW/ton",null,"Same","Same","Same","Same"]
[null,"UT-Water Cooled-Scroll-C","UT","Water Cooled","Scroll","C","≥ 150 tons and < 300 tons",0.66,0.54,0.68,0.44,"kW/ton",0.71799999999999997,0.57399999999999995,346.94119633464976,25.474144365156633,17.690378031358772,null,null,0.66,0.54,0.68,0.44,"kW/ton",null,"Same","Same","Same","Same"]
[null,"UT-Water Cooled-Scroll-D","UT","Water Cooled","Scroll","D","≥ 300 tons and < 600 tons",0.61,0.52,0.625,0.41,"kW/ton",0.63900000000000001,0.51100000000000001,275.83630822489715,11.398920686211682,8.9054067861028763,null,null,0.61,0.52,0.625,0.41,"kW/ton",null,"Same","Same","Same","Same"]
[null,"UT-Water Cooled-Scroll-E","UT","Water Cooled","Scroll","E","≥ 600 tons",0.56000000000000005,0.5,0.58499999999999996,0.38,"kW/ton",null,null,null,null,null,null,null,0.56000000000000005,0.5,0.58499999999999996,0.38,null,null,"Same","Same","Same","Same"]
[null,"UT-Water Cooled-Centrifugal-A","UT","Water Cooled","Centrifugal","A","< 75 tons",0.61,0.55000000000000004,0.69499999999999995,0.44,"kW/ton",0.63400000000000001,0.56000000000000005,468.68792761740599,145.51913915158866,{"$f":"P204/((M204-N204)/0.1)","v":196.6474853399848},null,null,0.61,0.55000000000000004,0.69499999999999995,0.44,"kW/ton",null,"Same","Same","Same","Same"]
[null,"UT-Water Cooled-Centrifugal-B","UT","Water Cooled","Centrifugal","B","< 150 tons",0.61,0.55000000000000004,0.69499999999999995,0.44,"kW/ton",0.63400000000000001,0.56000000000000005,468.68792761740599,145.51913915158866,196.6474853399848,null,null,0.61,0.55000000000000004,0.69499999999999995,0.44,"kW/ton",null,"Same","Same","Same","Same"]
[null,"UT-Water Cooled-Centrifugal-C","UT","Water Cooled","Centrifugal","C","≥ 150 tons and < 300 tons",0.61,0.55000000000000004,0.63500000000000001,0.4,"kW/ton",0.63400000000000001,0.50700000000000001,338.7655378428837,93.841774058426779,73.891160675926599,null,null,0.61,0.55000000000000004,0.63500000000000001,0.4,"kW/ton",null,"Same","Same","Same","Same"]
[null,"UT-Water Cooled-Centrifugal-D","UT","Water Cooled","Centrifugal","D","≥ 300 tons and < 400 tons",0.56000000000000005,0.52,0.59499999999999997,0.39,"kW/ton",0.57599999999999996,0.46100000000000002,267.71423093494184,65.580715023103664,57.026708715742352,null,null,0.56000000000000005,0.52,0.59499999999999997,0.39,"kW/ton",null,"Same","Same","Same","Same"]
[null,"UT-Water Cooled-Centrifugal-E","UT","Water Cooled","Centrifugal","E","≥ 400 tons and < 600 tons",{"$f":"T208","v":0.56000000000000005},0.5,0.58499999999999996,0.38,"kW/ton",0.57599999999999996,0.46100000000000002,267.71423093494184,65.580715023103664,57.026708715742352,null,null,0.56000000000000005,0.5,0.58499999999999996,0.38,"kW/ton",null,"Same","Same","Same","Same"]
[null,"UT-Water Cooled-Centrifugal-F","UT","Water Cooled","Centrifugal","F","≥ 600 tons",{"$f":"T209","v":0.56000000000000005},0.5,0.58499999999999996,0.38,"kW/ton",0.57599999999999996,0.46100000000000002,267.71423093494184,65.580715023103664,57.026708715742352,null,null,0.56000000000000005,0.5,0.58499999999999996,0.38,"kW/ton",null,"Same","Same","Same","Same"]
[]
[null,"Equipment ID","State","Heat Rejection","Type","Size","Size ID","Minimum COP (kW/ton)","Minimum IPLV (kW/ton)",null,null,"Unit","DEER Baseline Efficiency","DEER New Efficiency (kW/ton)","DEER Baseline cost","DEER Incremental Cost ($/ton)","($/ton/(0.1 kW/ton) increase)",null,null,"Minimum Full Load (COP)","Minimum IPLV (COP)",null,null,"Unit"]
[null,null,"California Chiller Data (Title 24 - 2013)"]
[null,{"$f":"CONCATENATE(C213,\"-\",D213,\"-\",E213,\"-\",F213)","v":"CA-Air Cooled-Reciprocating-A"},"CA","Air Cooled","Reciprocating","A","< 150 tons",{"$f":"12/T213","v":1.2549675800041833},{"$f":"12/U213","v":0.96},"NA","NA","kW/ton",null,null,null,null,null,null,null,9.5619999999999994,12.5,"NA","NA","EER"]
[null,{"$f":"CONCATENATE(C214,\"-\",D214,\"-\",E214,\"-\",F214)","v":"CA-Air Cooled-Reciprocating-B"},"CA","Air Cooled","Reciprocating","B","≥ 150 tons",{"$f":"12/T214","v":1.2549675800041833},{"$f":"12/U214","v":0.94117647058823528},"NA","NA","kW/ton",null,null,null,null,null,null,null,9.5619999999999994,12.75,"NA","NA","EER"]
[null,"CA-Air Cooled-Rotary-A","CA","Air Cooled","Rotary","A","< 150 tons",1.2549675800041833,0.96,"NA","NA","kW/ton",null,null,null,null,null,null,null,9.5619999999999994,12.5,"NA","NA","EER"]
[null,"CA-Air Cooled-Rotary-B","CA","Air Cooled","Rotary","B","≥ 150 tons",1.2549675800041833,0.94117647058823528,"NA","NA","kW/ton",null,null,null,null,null,null,null,9.5619999999999994,12.75,"NA","NA","EER"]
[null,"CA-Air Cooled-Screw-A","CA","Air Cooled","Screw","A","< 150 tons",1.2549675800041833,0.96,"NA","NA","kW/ton",null,null,null,null,null,null,null,9.5619999999999994,12.5,"NA","NA","EER"]
[null,"CA-Air Cooled-Screw-B","CA","Air Cooled","Screw","B","≥ 150 tons",1.2549675800041833,0.94117647058823528,"NA","NA","kW/ton",null,null,null,null,null,null,null,9.5619999999999994,12.75,"NA","NA","EER"]
[null,"CA-Air Cooled-Scroll-A","CA","Air Cooled","Scroll","A","< 150 tons",1.2549675800041833,0.96,"NA","NA","kW/ton",null,null,null,null,null,null,null,9.5619999999999994,12.5,"NA","NA","EER"]
[null,"CA-Air Cooled-Scroll-B","CA","Air Cooled","Scroll","B","≥ 150 tons",1.2549675800041833,0.94117647058823528,"NA","NA","kW/ton",null,null,null,null,null,null,null,9.5619999999999994,12.75,"NA","NA","EER"]
[null,"CA-Water Cooled-Reciprocating-A","CA","Water Cooled","Reciprocating","A","< 75 tons",0.78,0.63,0.8,0.6,"kW/ton",null,null,null,null,null,null,null,0.78,0.63,0.8,0.6,"kW/ton"]
[null,"CA-Water Cooled-Reciprocating-B","CA","Water Cooled","Reciprocating","B","≥ 75 tons and < 150 tons",0.77500000000000002,0.61499999999999999,0.79,0.58599999999999997,"kW/ton",null,null,null,null,null,null,null,0.77500000000000002,0.61499999999999999,0.79,0.58599999999999997,"kW/ton"]
[null,"CA-Water Cooled-Reciprocating-C","CA","Water Cooled","Reciprocating","C","≥ 150 tons and < 300 tons",0.68,0.57999999999999996,0.71799999999999997,0.54,"kW/ton",null,null,null,null,null,null,null,0.68,0.57999999999999996,0.71799999999999997,0.54,"kW/ton"]
[null,"CA-Water Cooled-Reciprocating-D","CA","Water Cooled","Reciprocating","D","≥ 300 tons",0.62,0.54,0.63900000000000001,0.49,"kW/ton",null,null,null,null,null,null,null,0.62,0.54,0.63900000000000001,0.49,"kW/ton"]
[null,"CA-Water Cooled-Rotary-A","CA","Water Cooled","Rotary","A","< 75 tons",0.78,0.63,0.8,0.6,"kW/ton",null,null,null,null,null,null,null,0.78,0.63,0.8,0.6,"kW/ton"]
[null,"CA-Water Cooled-Rotary-B","CA","Water Cooled","Rotary","B","≥ 75 tons and < 150 tons",0.77500000000000002,0.61499999999999999,0.79,0.58599999999999997,"kW/ton",null,null,null,null,null,null,null,0.77500000000000002,0.61499999999999999,0.79,0.58599999999999997,"kW/ton"]
[null,"CA-Water Cooled-Rotary-C","CA","Water Cooled","Rotary","C","≥ 150 tons and < 300 tons",0.68,0.57999999999999996,0.71799999999999997,0.54,"kW/ton",null,null,null,null,null,null,null,0.68,0.57999999999999996,0.71799999999999997,0.54,"kW/ton"]
[null,"CA-Water Cooled-Rotary-D","CA","Water Cooled","Rotary","D","≥ 300 tons",0.62,0.54,0.63900000000000001,0.49,"kW/ton",null,null,null,null,null,null,null,0.62,0.54,0.63900000000000001,0.49,"kW/ton"]
[null,"CA-Water Cooled-Screw-A","CA","Water Cooled","Screw","A","< 75 tons",0.78,0.63,0.8,0.6,"kW/ton",null,null,null,null,null,null,null,0.78,0.63,0.8,0.6,"kW/ton"]
[null,"CA-Water Cooled-Screw-B","CA","Water Cooled","Screw","B","≥ 75 tons and < 150 tons",0.77500000000000002,0.61499999999999999,0.79,0.58599999999999997,"kW/ton",null,null,null,null,null,null,null,0.77500000000000002,0.61499999999999999,0.79,0.58599999999999997,"kW/ton"]
[null,"CA-Water Cooled-Screw-C","CA","Water Cooled","Screw","C","≥ 150 tons and < 300 tons",0.68,0.57999999999999996,0.71799999999999997,0.54,"kW/ton",null,null,null,null,null,null,null,0.68,0.57999999999999996,0.71799999999999997,0.54,"kW/ton"]
[null,"CA-Water Cooled-Screw-D","CA","Water Cooled","Screw","D","≥ 300 tons",0.62,0.54,0.63900000000000001,0.49,"kW/ton",null,null,null,null,null,null,null,0.62,0.54,0.63900000000000001,0.49,"kW/ton"]
[null,"CA-Water Cooled-Scroll-A","CA","Water Cooled","Scroll","A","< 75 tons",0.78,0.63,0.8,0.6,"kW/ton",null,null,null,null,null,null,null,0.78,0.63,0.8,0.6,"kW/ton"]
[null,"CA-Water Cooled-Scroll-B","CA","Water Cooled","Scroll","B","≥ 75 tons and < 150 tons",0.77500000000000002,0.61499999999999999,0.79,0.58599999999999997,"kW/ton",null,null,null,null,null,null,null,0.77500000000000002,0.61499999999999999,0.79,0.58599999999999997,"kW/ton"]
[null,"CA-Water Cooled-Scroll-C","CA","Water Cooled","Scroll","C","≥ 150 tons and < 300 tons",0.68,0.57999999999999996,0.71799999999999997,0.54,"kW/ton",null,null,null,null,null,null,null,0.68,0.57999999999999996,0.71799999999999997,0.54,"kW/ton"]
[null,"CA-Water Cooled-Scroll-D","CA","Water Cooled","Scroll","D","≥ 300 tons",0.62,0.54,0.63900000000000001,0.49,"kW/ton",null,null,null,null,null,null,null,0.62,0.54,0.63900000000000001,0.49,"kW/ton"]
[null,"CA-Water Cooled-Centrifugal-A","CA","Water Cooled","Centrifugal","A","< 75 tons",0.63400000000000001,0.59599999999999997,0.63900000000000001,0.45,"kW/ton",null,null,null,null,null,null,null,0.63400000000000001,0.59599999999999997,0.63900000000000001,0.45,"kW/ton"]
[null,{"$f":"CONCATENATE(C238,\"-\",D238,\"-\",E238,\"-\",F238)","v":"CA-Water Cooled-Centrifugal-B"},"CA","Water Cooled","Centrifugal","B","< 150 tons",0.63400000000000001,0.59599999999999997,0.63900000000000001,0.45,"kW/ton",null,null,null,null,null,null,null,0.63400000000000001,0.59599999999999997,0.63900000000000001,0.45,"kW/ton"]
[null,{"$f":"CONCATENATE(C239,\"-\",D239,\"-\",E239,\"-\",F239)","v":"CA-Water Cooled-Centrifugal-C"},"CA","Water Cooled","Centrifugal","C","≥ 150 tons and < 300 tons",0.63400000000000001,0.59599999999999997,0.63900000000000001,0.45,"kW/ton",null,null,null,null,null,null,null,0.63400000000000001,0.59599999999999997,0.63900000000000001,0.45,"kW/ton"]
[null,{"$f":"CONCATENATE(C240,\"-\",D240,\"-\",E240,\"-\",F240)","v":"CA-Water Cooled-Centrifugal-D"},"CA","Water Cooled","Centrifugal","D","≥ 300 tons and < 600 tons",0.57599999999999996,0.54900000000000004,0.6,0.4,"kW/ton",null,null,null,null,null,null,null,0.57599999999999996,0.54900000000000004,0.6,0.4,"kW/ton"]
[null,{"$f":"CONCATENATE(C241,\"-\",D241,\"-\",E241,\"-\",F241)","v":"CA-Water Cooled-Centrifugal-E"},"CA","Water Cooled","Centrifugal","E","≥ 600 tons",0.56999999999999995,0.53900000000000003,0.59,0.4,"kW/ton",null,null,null,null,null,null,null,0.56999999999999995,0.53900000000000003,0.59,0.4,"kW/ton"]
[]
[null,"Equipment ID","State","Heat Rejection","Type","Size","Size ID","Minimum COP (kW/ton)","Minimum IPLV (kW/ton)",null,null,"Unit","DEER Baseline Efficiency","DEER New Efficiency (kW/ton)","DEER Baseline cost","DEER Incremental Cost ($/ton)","($/ton/(0.1 kW/ton) increase)",null,null,"Minimum Full Load (COP)","Minimum IPLV (COP)",null,null,"Unit"]
[null,null,"Wyoming Chiller Data (IECC 2009) - Effective Dec. 1, 2014"]
[null,{"$f":"CONCATENATE(C245,\"-\",D245,\"-\",E245,\"-\",F245)","v":"WY-Air Cooled-Reciprocating-A"},"WY","Air Cooled","Reciprocating","A","< 150 tons",{"$f":"12/T245","v":1.2549675800041833},{"$f":"12/U245","v":0.96},"NA","NA","kW/ton",1.26,1.008,448.95363636363641,39.935252525252508,{"$f":"P245/((M245-N245)/0.1)","v":15.847322430655757},null,null,9.5619999999999994,12.5,"NA","NA","EER"]
[null,{"$f":"CONCATENATE(C246,\"-\",D246,\"-\",E246,\"-\",F246)","v":"WY-Air Cooled-Reciprocating-B"},"WY","Air Cooled","Reciprocating","B","≥ 150 tons",{"$f":"12/T246","v":1.2549675800041833},{"$f":"12/U246","v":0.94117647058823528},"NA","NA","kW/ton",1.26,1.008,448.95363636363641,39.935252525252508,15.847322430655757,null,null,9.5619999999999994,12.75,"NA","NA","EER"]
[null,"WY-Air Cooled-Rotary-A","WY","Air Cooled","Rotary","A","< 150 tons",1.2549675800041833,0.96,"NA","NA","kW/ton",1.26,1.008,448.95363636363641,39.935252525252508,15.847322430655757,null,null,9.5619999999999994,12.5,"NA","NA","EER"]
[null,"WY-Air Cooled-Rotary-B","WY","Air Cooled","Rotary","B","≥ 150 tons",1.2549675800041833,0.94117647058823528,"NA","NA","kW/ton",1.26,1.008,448.95363636363641,39.935252525252508,15.847322430655757,null,null,9.5619999999999994,12.75,"NA","NA","EER"]
[null,"WY-Air Cooled-Screw-A","WY","Air Cooled","Screw","A","< 150 tons",1.2549675800041833,0.96,"NA","NA","kW/ton",1.26,1.008,448.95363636363641,39.935252525252508,15.847322430655757,null,null,9.5619999999999994,12.5,"NA","NA","EER"]
[null,"WY-Air Cooled-Screw-B","WY","Air Cooled","Screw","B","≥ 150 tons",1.2549675800041833,0.94117647058823528,"NA","NA","kW/ton",1.26,1.008,448.95363636363641,39.935252525252508,15.847322430655757,null,null,9.5619999999999994,12.75,"NA","NA","EER"]
[null,"WY-Air Cooled-Scroll-A","WY","Air Cooled","Scroll","A","< 150 tons",1.2549675800041833,0.96,"NA","NA","kW/ton",1.26,1.008,448.95363636363641,39.935252525252508,15.847322430655757,null,null,9.5619999999999994,12.5,"NA","NA","EER"]
[null,"WY-Air Cooled-Scroll-B","WY","Air Cooled","Scroll","B","≥ 150 tons",1.2549675800041833,0.94117647058823528,"NA","NA","kW/ton",1.26,1.008,448.95363636363641,39.935252525252508,15.847322430655757,null,null,9.5619999999999994,12.75,"NA","NA","EER"]
[null,"WY-Water Cooled-Reciprocating-A","WY","Water Cooled","Reciprocating","A","< 75 tons",0.78,0.63,0.8,0.6,"kW/ton",0.83699999999999997,0.67200000000000004,462.58824239497829,16.274341238578074,9.8632371142897473,null,null,0.78,0.63,0.8,0.6,"kW/ton"]
[null,"WY-Water Cooled-Reciprocating-B","WY","Water Cooled","Reciprocating","B","≥ 75 tons and < 150 tons",0.77500000000000002,0.61499999999999999,0.79,0.58599999999999997,"kW/ton",0.83699999999999997,0.67200000000000004,462.58824239497829,16.274341238578074,9.8632371142897473,null,null,0.77500000000000002,0.61499999999999999,0.79,0.58599999999999997,"kW/ton"]
[null,"WY-Water Cooled-Reciprocating-C","WY","Water Cooled","Reciprocating","C","≥ 150 tons and < 300 tons",0.68,0.57999999999999996,0.71799999999999997,0.54,"kW/ton",0.83699999999999997,0.67200000000000004,462.58824239497829,16.274341238578074,9.8632371142897473,null,null,0.68,0.57999999999999996,0.71799999999999997,0.54,"kW/ton"]
[null,"WY-Water Cooled-Reciprocating-D","WY","Water Cooled","Reciprocating","D","≥ 300 tons",0.62,0.54,0.63900000000000001,0.49,"kW/ton",0.83699999999999997,0.67200000000000004,462.58824239497829,16.274341238578074,{"$f":"P256/((M256-N256)/0.1)","v":9.8632371142897473},null,null,0.62,0.54,0.63900000000000001,0.49,"kW/ton"]
[null,"WY-Water Cooled-Rotary-A","WY","Water Cooled","Rotary","A","< 75 tons",0.78,0.63,0.8,0.6,"kW/ton",0.79,0.63200000000000001,443.38924926972516,49.053878122290939,{"$f":"P257/((M257-N257)/0.1)","v":31.046758305247423},null,null,0.78,0.63,0.8,0.6,"kW/ton"]
[null,"WY-Water Cooled-Rotary-B","WY","Water Cooled","Rotary","B","≥ 75 tons and < 150 tons",0.77500000000000002,0.61499999999999999,0.79,0.58599999999999997,"kW/ton",0.79,0.63200000000000001,443.38924926972516,49.053878122290939,{"$f":"P258/((M258-N258)/0.1)","v":31.046758305247423},null,null,0.77500000000000002,0.61499999999999999,0.79,0.58599999999999997,"kW/ton"]
[null,"WY-Water Cooled-Rotary-C","WY","Water Cooled","Rotary","C","≥ 150 tons and < 300 tons",0.68,0.57999999999999996,0.71799999999999997,0.54,"kW/ton",0.71799999999999997,0.57399999999999995,346.94119633464976,25.474144365156633,{"$f":"P259/((M259-N259)/0.1)","v":17.690378031358772},null,null,0.68,0.57999999999999996,0.71799999999999997,0.54,"kW/ton"]
[null,"WY-Water Cooled-Rotary-D","WY","Water Cooled","Rotary","D","≥ 300 tons",0.62,0.54,0.63900000000000001,0.49,"kW/ton",0.63900000000000001,0.51100000000000001,275.83630822489715,11.398920686211682,{"$f":"P260/((M260-N260)/0.1)","v":8.9054067861028763},null,null,0.62,0.54,0.63900000000000001,0.49,"kW/ton"]
[null,"WY-Water Cooled-Screw-A","WY","Water Cooled","Screw","A","< 75 tons",0.78,0.63,0.8,0.6,"kW/ton",0.79,0.63200000000000001,443.38924926972516,49.053878122290939,{"$f":"P261/((M261-N261)/0.1)","v":31.046758305247423},null,null,0.78,0.63,0.8,0.6,"kW/ton"]
[null,"WY-Water Cooled-Screw-B","WY","Water Cooled","Screw","B","≥ 75 tons and < 150 tons",0.77500000000000002,0.61499999999999999,0.79,0.58599999999999997,"kW/ton",0.79,0.63200000000000001,443.38924926972516,49.053878122290939,31.046758305247423,null,null,0.77500000000000002,0.61499999999999999,0.79,0.58599999999999997,"kW/ton"]
[null,"WY-Water Cooled-Screw-C","WY","Water Cooled","Screw","C","≥ 150 tons and < 300 tons",0.68,0.57999999999999996,0.71799999999999997,0.54,"kW/ton",0.71799999999999997,0.57399999999999995,346.94119633464976,25.474144365156633,17.690378031358772,null,null,0.68,0.57999999999999996,0.71799999999999997,0.54,"kW/ton"]
[null,"WY-Water Cooled-Screw-D","WY","Water Cooled","Screw","D","≥ 300 tons",0.62,0.54,0.63900000000000001,0.49,"kW/ton",0.63900000000000001,0.51100000000000001,275.83630822489715,11.398920686211682,8.9054067861028763,null,null,0.62,0.54,0.63900000000000001,0.49,"kW/ton"]
[null,"WY-Water Cooled-Scroll-A","WY","Water Cooled","Scroll","A","< 75 tons",0.78,0.63,0.8,0.6,"kW/ton",0.79,0.63200000000000001,443.38924926972516,49.053878122290939,31.046758305247423,null,null,0.78,0.63,0.8,0.6,"kW/ton"]
[null,"WY-Water Cooled-Scroll-B","WY","Water Cooled","Scroll","B","≥ 75 tons and < 150 tons",0.77500000000000002,0.61499999999999999,0.79,0.58599999999999997,"kW/ton",0.79,0.63200000000000001,443.38924926972516,49.053878122290939,31.046758305247423,null,null,0.77500000000000002,0.61499999999999999,0.79,0.58599999999999997,"kW/ton"]
[null,"WY-Water Cooled-Scroll-C","WY","Water Cooled","Scroll","C","≥ 150 tons and < 300 tons",0.68,0.57999999999999996,0.71799999999999997,0.54,"kW/ton",0.71799999999999997,0.57399999999999995,346.94119633464976,25.474144365156633,17.690378031358772,null,null,0.68,0.57999999999999996,0.71799999999999997,0.54,"kW/ton"]
[null,"WY-Water Cooled-Scroll-D","WY","Water Cooled","Scroll","D","≥ 300 tons",0.62,0.54,0.63900000000000001,0.49,"kW/ton",0.63900000000000001,0.51100000000000001,275.83630822489715,11.398920686211682,8.9054067861028763,null,null,0.62,0.54,0.63900000000000001,0.49,"kW/ton"]
[null,"WY-Water Cooled-Centrifugal-A","WY","Water Cooled","Centrifugal","A","< 75 tons",0.63400000000000001,0.59599999999999997,0.63900000000000001,0.45,"kW/ton",0.63400000000000001,0.56000000000000005,468.68792761740599,145.51913915158866,196.6474853399848,null,null,0.63400000000000001,0.59599999999999997,0.63900000000000001,0.45,"kW/ton"]
[null,{"$f":"CONCATENATE(C270,\"-\",D270,\"-\",E270,\"-\",F270)","v":"WY-Water Cooled-Centrifugal-B"},"WY","Water Cooled","Centrifugal","B","< 150 tons",0.63400000000000001,0.59599999999999997,0.63900000000000001,0.45,"kW/ton",0.63400000000000001,0.56000000000000005,468.68792761740599,145.51913915158866,196.6474853399848,null,null,0.63400000000000001,0.59599999999999997,0.63900000000000001,0.45,"kW/ton"]
[null,{"$f":"CONCATENATE(C271,\"-\",D271,\"-\",E271,\"-\",F271)","v":"WY-Water Cooled-Centrifugal-C"},"WY","Water Cooled","Centrifugal","C","≥ 150 tons and < 300 tons",0.63400000000000001,0.59599999999999997,0.63900000000000001,0.45,"kW/ton",0.63400000000000001,0.50700000000000001,338.7655378428837,93.841774058426779,73.891160675926599,null,null,0.63400000000000001,0.59599999999999997,0.63900000000000001,0.45,"kW/ton"]
[null,{"$f":"CONCATENATE(C272,\"-\",D272,\"-\",E272,\"-\",F272)","v":"WY-Water Cooled-Centrifugal-D"},"WY","Water Cooled","Centrifugal","D","≥ 300 tons and < 400 tons",0.57599999999999996,0.54900000000000004,0.6,0.4,"kW/ton",0.57599999999999996,0.46100000000000002,267.71423093494184,65.580715023103664,57.026708715742352,null,null,0.57599999999999996,0.54900000000000004,0.6,0.4,"kW/ton"]
[null,{"$f":"CONCATENATE(C273,\"-\",D273,\"-\",E273,\"-\",F273)","v":"WY-Water Cooled-Centrifugal-E"},"WY","Water Cooled","Centrifugal","E","≥ 400 tons and < 600 tons",0.57599999999999996,0.54900000000000004,0.6,0.4,"kW/ton",0.57599999999999996,0.46100000000000002,267.71423093494184,65.580715023103664,{"$f":"P273/((M273-N273)/0.1)","v":57.026708715742352},null,null,0.57599999999999996,0.54900000000000004,0.6,0.4,"kW/ton"]
[null,{"$f":"CONCATENATE(C274,\"-\",D274,\"-\",E274,\"-\",F274)","v":"WY-Water Cooled-Centrifugal-F"},"WY","Water Cooled","Centrifugal","F","≥ 600 tons",0.56999999999999995,0.53900000000000003,0.59,0.4,"kW/ton",0.57599999999999996,0.46100000000000002,267.71423093494184,65.580715023103664,57.026708715742352,null,null,0.56999999999999995,0.53900000000000003,0.59,0.4,"kW/ton"]
[]
[null,"Equipment ID","State","Heat Rejection","Type","Size","Size ID","Minimum COP (kW/ton)","Minimum IPLV (kW/ton)",null,null,"Unit","DEER Baseline Efficiency","DEER New Efficiency (kW/ton)","DEER Baseline cost","DEER Incremental Cost ($/ton)","($/ton/(0.1 kW/ton) increase)",null,null,"Minimum Full Load (COP)","Minimum IPLV (COP)",null,null,"Unit"]
[null,null,"IDAHO Chiller Data (IECC 2018) - Effective January 1, 2021"]
[null,{"$f":"CONCATENATE(C278,\"-\",D278,\"-\",E278,\"-\",F278)","v":"ID-Air Cooled-Reciprocating-A"},"ID","Air Cooled","Reciprocating","A","< 150 tons",{"$f":"12/T278","v":1.1881188118811881},{"$f":"12/U278","v":0.87591240875912413},{"$f":"12/V278","v":1.2371134020618557},{"$f":"12/W278","v":0.75949367088607589},"kW/ton",1.26,1.008,448.95363636363641,39.935252525252508,{"$f":"P278/((M278-N278)/0.1)","v":15.847322430655757},null,null,10.1,13.7,9.6999999999999993,15.8,"EER"]
[null,{"$f":"CONCATENATE(C279,\"-\",D279,\"-\",E279,\"-\",F279)","v":"ID-Air Cooled-Reciprocating-B"},"ID","Air Cooled","Reciprocating","B","≥ 150 tons",{"$f":"12/T279","v":1.1881188118811881},0.8571428571428571,1.2371134020618557,0.74534161490683226,"kW/ton",1.26,1.008,448.95363636363641,39.935252525252508,15.847322430655757,null,null,10.1,14,9.6999999999999993,16.100000000000001,"EER"]
[null,"ID-Air Cooled-Rotary-A","ID","Air Cooled","Rotary","A","< 150 tons",1.1881188118811881,0.87591240875912413,1.2371134020618557,0.75949367088607589,"kW/ton",1.26,1.008,448.95363636363641,39.935252525252508,15.847322430655757,null,null,10.1,13.7,9.6999999999999993,15.8,"EER"]
[null,"ID-Air Cooled-Rotary-B","ID","Air Cooled","Rotary","B","≥ 150 tons",1.1881188118811881,0.8571428571428571,1.2371134020618557,0.74534161490683226,"kW/ton",1.26,1.008,448.95363636363641,39.935252525252508,15.847322430655757,null,null,10.1,14,9.6999999999999993,16.100000000000001,"EER"]
[null,"ID-Air Cooled-Screw-A","ID","Air Cooled","Screw","A","< 150 tons",1.1881188118811881,0.87591240875912413,1.2371134020618557,0.75949367088607589,"kW/ton",1.26,1.008,448.95363636363641,39.935252525252508,15.847322430655757,null,null,10.1,13.7,9.6999999999999993,15.8,"EER"]
[null,"ID-Air Cooled-Screw-B","ID","Air Cooled","Screw","B","≥ 150 tons",1.1881188118811881,0.8571428571428571,1.2371134020618557,0.74534161490683226,"kW/ton",1.26,1.008,448.95363636363641,39.935252525252508,15.847322430655757,null,null,10.1,14,9.6999999999999993,16.100000000000001,"EER"]
[null,"ID-Air Cooled-Scroll-A","ID","Air Cooled","Scroll","A","< 150 tons",1.1881188118811881,0.87591240875912413,1.2371134020618557,0.75949367088607589,"kW/ton",1.26,1.008,448.95363636363641,39.935252525252508,15.847322430655757,null,null,10.1,13.7,9.6999999999999993,15.8,"EER"]
[null,"ID-Air Cooled-Scroll-B","ID","Air Cooled","Scroll","B","≥ 150 tons",1.1881188118811881,0.8571428571428571,1.2371134020618557,0.74534161490683226,"kW/ton",1.26,1.008,448.95363636363641,39.935252525252508,15.847322430655757,null,null,10.1,14,9.6999999999999993,16.100000000000001,"EER"]
[null,"ID-Water Cooled-Reciprocating-A","ID","Water Cooled","Reciprocating","A","< 75 tons",{"$f":"T286","v":0.75},{"$f":"U286","v":0.6},{"$f":"V286","v":0.78},{"$f":"W286","v":0.5},"kW/ton",0.83699999999999997,0.67200000000000004,462.58824239497829,16.274341238578074,9.8632371142897473,null,null,0.75,0.6,0.78,0.5,"kW/ton"]
[null,"ID-Water Cooled-Reciprocating-B","ID","Water Cooled","Reciprocating","B","≥ 75 tons and < 150 tons",{"$f":"T287","v":0.72},0.56000000000000005,0.75,0.49,"kW/ton",0.83699999999999997,0.67200000000000004,462.58824239497829,16.274341238578074,9.8632371142897473,null,null,0.72,0.56000000000000005,0.75,0.49,"kW/ton"]
[null,"ID-Water Cooled-Reciprocating-C","ID","Water Cooled","Reciprocating","C","≥ 150 tons and < 300 tons",0.66,0.54,0.68,0.44,"kW/ton",0.83699999999999997,0.67200000000000004,462.58824239497829,16.274341238578074,9.8632371142897473,null,null,0.66,0.54,0.68,0.44,"kW/ton"]
[null,"ID-Water Cooled-Reciprocating-D","ID","Water Cooled","Reciprocating","D","≥ 300 tons and < 600 tons",0.61,0.52,0.625,0.41,"kW/ton",0.83699999999999997,0.67200000000000004,462.58824239497829,16.274341238578074,{"$f":"P289/((M289-N289)/0.1)","v":9.8632371142897473},null,null,0.61,0.52,0.625,0.41,"kW/ton"]
[null,"ID-Water Cooled-Reciprocating-E","ID","Water Cooled","Reciprocating","E","≥ 600 tons",0.56000000000000005,0.5,0.58499999999999996,0.38,"kW/ton",null,null,null,null,null,null,null,0.56000000000000005,0.5,0.58499999999999996,0.38,"kW/ton"]
[null,"ID-Water Cooled-Rotary-A","ID","Water Cooled","Rotary","A","< 75 tons",0.75,0.6,0.78,0.5,"kW/ton",0.79,0.63200000000000001,443.38924926972516,49.053878122290939,{"$f":"P291/((M291-N291)/0.1)","v":31.046758305247423},null,null,0.75,0.6,0.78,0.5,"kW/ton"]
[null,"ID-Water Cooled-Rotary-B","ID","Water Cooled","Rotary","B","≥ 75 tons and < 150 tons",0.72,0.56000000000000005,0.75,0.49,"kW/ton",0.79,0.63200000000000001,443.38924926972516,49.053878122290939,{"$f":"P292/((M292-N292)/0.1)","v":31.046758305247423},null,null,0.72,0.56000000000000005,0.75,0.49,"kW/ton"]
[null,"ID-Water Cooled-Rotary-C","ID","Water Cooled","Rotary","C","≥ 150 tons and < 300 tons",0.66,0.54,0.68,0.44,"kW/ton",0.71799999999999997,0.57399999999999995,346.94119633464976,25.474144365156633,{"$f":"P293/((M293-N293)/0.1)","v":17.690378031358772},null,null,0.66,0.54,0.68,0.44,"kW/ton"]
[null,"ID-Water Cooled-Rotary-D","ID","Water Cooled","Rotary","D","≥ 300 tons and < 600 tons",0.61,0.52,0.625,0.41,"kW/ton",0.63900000000000001,0.51100000000000001,275.83630822489715,11.398920686211682,{"$f":"P294/((M294-N294)/0.1)","v":8.9054067861028763},null,null,0.61,0.52,0.625,0.41,"kW/ton"]
[null,"ID-Water Cooled-Rotary-E","ID","Water Cooled","Rotary","E","≥ 600 tons",0.56000000000000005,0.5,0.58499999999999996,0.38,"kW/ton",null,null,null,null,null,null,null,0.56000000000000005,0.5,0.58499999999999996,0.38]
[null,"ID-Water Cooled-Screw-A","ID","Water Cooled","Screw","A","< 75 tons",0.75,0.6,0.78,0.5,"kW/ton",0.79,0.63200000000000001,443.38924926972516,49.053878122290939,{"$f":"P296/((M296-N296)/0.1)","v":31.046758305247423},null,null,0.75,0.6,0.78,0.5,"kW/ton"]
[null,"ID-Water Cooled-Screw-B","ID","Water Cooled","Screw","B","≥ 75 tons and < 150 tons",0.72,0.56000000000000005,0.75,0.49,"kW/ton",0.79,0.63200000000000001,443.38924926972516,49.053878122290939,31.046758305247423,null,null,0.72,0.56000000000000005,0.75,0.49,"kW/ton"]
[null,"ID-Water Cooled-Screw-C","ID","Water Cooled","Screw","C","≥ 150 tons and < 300 tons",0.66,0.54,0.68,0.44,"kW/ton",0.71799999999999997,0.57399999999999995,346.94119633464976,25.474144365156633,17.690378031358772,null,null,0.66,0.54,0.68,0.44,"kW/ton"]
[null,"ID-Water Cooled-Screw-D","ID","Water Cooled","Screw","D","≥ 300 tons and < 600 tons",0.61,0.52,0.625,0.41,"kW/ton",0.63900000000000001,0.51100000000000001,275.83630822489715,11.398920686211682,8.9054067861028763,null,null,0.61,0.52,0.625,0.41,"kW/ton"]
[null,"ID-Water Cooled-Screw-E","ID","Water Cooled","Screw","E","≥ 600 tons",0.56000000000000005,0.5,0.58499999999999996,0.38,"kW/ton",null,null,null,null,null,null,null,0.56000000000000005,0.5,0.58499999999999996,0.38]
[null,"ID-Water Cooled-Scroll-A","ID","Water Cooled","Scroll","A","< 75 tons",0.75,0.6,0.78,0.5,"kW/ton",0.79,0.63200000000000001,443.38924926972516,49.053878122290939,{"$f":"P301/((M301-N301)/0.1)","v":31.046758305247423},null,null,0.75,0.6,0.78,0.5,"kW/ton"]
[null,"ID-Water Cooled-Scroll-B","ID","Water Cooled","Scroll","B","≥ 75 tons and < 150 tons",0.72,0.56000000000000005,0.75,0.49,"kW/ton",0.79,0.63200000000000001,443.38924926972516,49.053878122290939,31.046758305247423,null,null,0.72,0.56000000000000005,0.75,0.49,"kW/ton"]
[null,"ID-Water Cooled-Scroll-C","ID","Water Cooled","Scroll","C","≥ 150 tons and < 300 tons",0.66,0.54,0.68,0.44,"kW/ton",0.71799999999999997,0.57399999999999995,346.94119633464976,25.474144365156633,17.690378031358772,null,null,0.66,0.54,0.68,0.44,"kW/ton"]
[null,"ID-Water Cooled-Scroll-D","ID","Water Cooled","Scroll","D","≥ 300 tons and < 600 tons",0.61,0.52,0.625,0.41,"kW/ton",0.63900000000000001,0.51100000000000001,275.83630822489715,11.398920686211682,8.9054067861028763,null,null,0.61,0.52,0.625,0.41,"kW/ton"]
[null,"ID-Water Cooled-Scroll-E","ID","Water Cooled","Scroll","E","≥ 600 tons",0.56000000000000005,0.5,0.58499999999999996,0.38,"kW/ton",null,null,null,null,null,null,null,0.56000000000000005,0.5,0.58499999999999996,0.38]
[null,"ID-Water Cooled-Centrifugal-A","ID","Water Cooled","Centrifugal","A","< 75 tons",0.61,0.55000000000000004,0.69499999999999995,0.44,"kW/ton",0.63400000000000001,0.56000000000000005,468.68792761740599,145.51913915158866,{"$f":"P306/((M306-N306)/0.1)","v":196.6474853399848},null,null,0.61,0.55000000000000004,0.69499999999999995,0.44,"kW/ton"]
[null,{"$f":"CONCATENATE(C307,\"-\",D307,\"-\",E307,\"-\",F307)","v":"ID-Water Cooled-Centrifugal-B"},"ID","Water Cooled","Centrifugal","B","< 150 tons",0.61,0.55000000000000004,0.69499999999999995,0.44,"kW/ton",0.63400000000000001,0.56000000000000005,468.68792761740599,145.51913915158866,196.6474853399848,null,null,0.61,0.55000000000000004,0.69499999999999995,0.44,"kW/ton"]
[null,{"$f":"CONCATENATE(C308,\"-\",D308,\"-\",E308,\"-\",F308)","v":"ID-Water Cooled-Centrifugal-C"},"ID","Water Cooled","Centrifugal","C","≥ 150 tons and < 300 tons",0.61,0.55000000000000004,0.63500000000000001,0.4,"kW/ton",0.63400000000000001,0.50700000000000001,338.7655378428837,93.841774058426779,73.891160675926599,null,null,0.61,0.55000000000000004,0.63500000000000001,0.4,"kW/ton"]
[null,"ID-Water Cooled-Centrifugal-D","ID","Water Cooled","Centrifugal","D","≥ 300 tons and < 400 tons",0.56000000000000005,0.52,0.59499999999999997,0.39,"kW/ton",0.57599999999999996,0.46100000000000002,267.71423093494184,65.580715023103664,57.026708715742352,null,null,0.56000000000000005,0.52,0.59499999999999997,0.39,"kW/ton"]
[null,"ID-Water Cooled-Centrifugal-E","ID","Water Cooled","Centrifugal","E","≥ 400 tons and < 600 tons",{"$f":"T310","v":0.56000000000000005},0.5,0.58499999999999996,0.38,"kW/ton",0.57599999999999996,0.46100000000000002,267.71423093494184,65.580715023103664,57.026708715742352,null,null,0.56000000000000005,0.5,0.58499999999999996,0.38,"kW/ton"]
[null,"ID-Water Cooled-Centrifugal-F","ID","Water Cooled","Centrifugal","F","≥ 600 tons",{"$f":"T311","v":0.56000000000000005},{"$f":"U311","v":0.5},{"$f":"V311","v":0.58499999999999996},{"$f":"W311","v":0.38},"kW/ton",0.57599999999999996,0.46100000000000002,267.71423093494184,65.580715023103664,{"$f":"P311/((M311-N311)/0.1)","v":57.026708715742352},null,null,0.56000000000000005,0.5,0.58499999999999996,0.38,"kW/ton"]
[]
[null,"Equipment ID","State","Heat Rejection","Type","Size","Size ID","Minimum COP (kW/ton)","Minimum IPLV (kW/ton)",null,null,"Unit","DEER Baseline Efficiency","DEER New Efficiency (kW/ton)","DEER Baseline cost","DEER Incremental Cost ($/ton)","($/ton/(0.1 kW/ton) increase)",null,null,"Minimum Full Load (COP)","Minimum IPLV (COP)",null,null,"Unit"]
[null,null,"Washington Chiller Data (WSEC 2018)"]
[null,{"$f":"CONCATENATE(C315,\"-\",D315,\"-\",E315,\"-\",F315)","v":"WA-Air Cooled-Reciprocating-1"},"WA","Air Cooled","Reciprocating",1,"< 150 tons",{"$f":"12/T315","v":1.1881188118811881},{"$f":"12/U315","v":0.87591240875912413},{"$f":"12/V315","v":1.2371134020618557},{"$f":"12/W315","v":0.75949367088607589},"kW/ton",1.26,1.008,448.95363636363641,39.935252525252508,{"$f":"P315/((M315-N315)/0.1)","v":15.847322430655757},null,null,10.1,13.7,9.6999999999999993,15.8,"EER"]
[null,{"$f":"CONCATENATE(C316,\"-\",D316,\"-\",E316,\"-\",F316)","v":"WA-Air Cooled-Reciprocating-2"},"WA","Air Cooled","Reciprocating",2,"≥ 150 tons",{"$f":"12/T316","v":1.1881188118811881},0.8571428571428571,1.2371134020618557,0.74534161490683226,"kW/ton",1.26,1.008,448.95363636363641,39.935252525252508,15.847322430655757,null,null,10.1,14,9.6999999999999993,16.100000000000001,"EER"]
[null,"WA-Air Cooled-Rotary-1","WA","Air Cooled","Rotary",1,"< 150 tons",1.1881188118811881,0.87591240875912413,1.2371134020618557,0.75949367088607589,"kW/ton",1.26,1.008,448.95363636363641,39.935252525252508,15.847322430655757,null,null,10.1,13.7,9.6999999999999993,15.8,"EER"]
[null,"WA-Air Cooled-Rotary-2","WA","Air Cooled","Rotary",2,"≥ 150 tons",1.1881188118811881,0.8571428571428571,1.2371134020618557,0.74534161490683226,"kW/ton",1.26,1.008,448.95363636363641,39.935252525252508,15.847322430655757,null,null,10.1,14,9.6999999999999993,16.100000000000001,"EER"]
[null,"WA-Air Cooled-Screw-1","WA","Air Cooled","Screw",1,"< 150 tons",1.1881188118811881,0.87591240875912413,1.2371134020618557,0.75949367088607589,"kW/ton",1.26,1.008,448.95363636363641,39.935252525252508,15.847322430655757,null,null,10.1,13.7,9.6999999999999993,15.8,"EER"]
[null,"WA-Air Cooled-Screw-2","WA","Air Cooled","Screw",2,"≥ 150 tons",1.1881188118811881,0.8571428571428571,1.2371134020618557,0.74534161490683226,"kW/ton",1.26,1.008,448.95363636363641,39.935252525252508,15.847322430655757,null,null,10.1,14,9.6999999999999993,16.100000000000001,"EER"]
[null,"WA-Air Cooled-Scroll-1","WA","Air Cooled","Scroll",1,"< 150 tons",1.1881188118811881,0.87591240875912413,1.2371134020618557,0.75949367088607589,"kW/ton",1.26,1.008,448.95363636363641,39.935252525252508,15.847322430655757,null,null,10.1,13.7,9.6999999999999993,15.8,"EER"]
[null,"WA-Air Cooled-Scroll-2","WA","Air Cooled","Scroll",2,"≥ 150 tons",1.1881188118811881,0.8571428571428571,1.2371134020618557,0.74534161490683226,"kW/ton",1.26,1.008,448.95363636363641,39.935252525252508,15.847322430655757,null,null,10.1,14,9.6999999999999993,16.100000000000001,"EER"]
[null,"WA-Water Cooled-Reciprocating-1","WA","Water Cooled","Reciprocating",1,"< 75 tons",{"$f":"T323","v":0.75},{"$f":"U323","v":0.6},{"$f":"V323","v":0.78},{"$f":"W323","v":0.5},"kW/ton",0.83699999999999997,0.67200000000000004,462.58824239497829,16.274341238578074,9.8632371142897473,null,null,0.75,0.6,0.78,0.5,"kW/ton"]
[null,"WA-Water Cooled-Reciprocating-2","WA","Water Cooled","Reciprocating",2,"≥ 75 tons and < 150 tons",{"$f":"T324","v":0.72},0.56000000000000005,0.75,0.49,"kW/ton",0.83699999999999997,0.67200000000000004,462.58824239497829,16.274341238578074,9.8632371142897473,null,null,0.72,0.56000000000000005,0.75,0.49,"kW/ton"]
[null,"WA-Water Cooled-Reciprocating-3","WA","Water Cooled","Reciprocating",3,"≥ 150 tons and < 300 tons",0.66,0.54,0.68,0.44,"kW/ton",0.83699999999999997,0.67200000000000004,462.58824239497829,16.274341238578074,9.8632371142897473,null,null,0.66,0.54,0.68,0.44,"kW/ton"]
[null,"WA-Water Cooled-Reciprocating-4","WA","Water Cooled","Reciprocating",4,"≥ 300 tons and < 600 tons",0.61,0.52,0.625,0.41,"kW/ton",0.83699999999999997,0.67200000000000004,462.58824239497829,16.274341238578074,{"$f":"P326/((M326-N326)/0.1)","v":9.8632371142897473},null,null,0.61,0.52,0.625,0.41,"kW/ton"]
[null,"WA-Water Cooled-Reciprocating-5","WA","Water Cooled","Reciprocating",5,"≥ 600 tons",0.56000000000000005,0.5,0.58499999999999996,0.38,"kW/ton",null,null,null,null,null,null,null,0.56000000000000005,0.5,0.58499999999999996,0.38]
[null,"WA-Water Cooled-Rotary-1","WA","Water Cooled","Rotary",1,"< 75 tons",0.75,0.6,0.78,0.5,"kW/ton",0.79,0.63200000000000001,443.38924926972516,49.053878122290939,{"$f":"P328/((M328-N328)/0.1)","v":31.046758305247423},null,null,0.75,0.6,0.78,0.5,"kW/ton"]
[null,"WA-Water Cooled-Rotary-2","WA","Water Cooled","Rotary",2,"≥ 75 tons and < 150 tons",0.72,0.56000000000000005,0.75,0.49,"kW/ton",0.79,0.63200000000000001,443.38924926972516,49.053878122290939,{"$f":"P329/((M329-N329)/0.1)","v":31.046758305247423},null,null,0.72,0.56000000000000005,0.75,0.49,"kW/ton"]
[null,"WA-Water Cooled-Rotary-3","WA","Water Cooled","Rotary",3,"≥ 150 tons and < 300 tons",0.66,0.54,0.68,0.44,"kW/ton",0.71799999999999997,0.57399999999999995,346.94119633464976,25.474144365156633,{"$f":"P330/((M330-N330)/0.1)","v":17.690378031358772},null,null,0.66,0.54,0.68,0.44,"kW/ton"]
[null,"WA-Water Cooled-Rotary-4","WA","Water Cooled","Rotary",4,"≥ 300 tons and < 600 tons",0.61,0.52,0.625,0.41,"kW/ton",0.63900000000000001,0.51100000000000001,275.83630822489715,11.398920686211682,{"$f":"P331/((M331-N331)/0.1)","v":8.9054067861028763},null,null,0.61,0.52,0.625,0.41,"kW/ton"]
[null,"WA-Water Cooled-Rotary-5","WA","Water Cooled","Rotary",5,"≥ 600 tons",0.56000000000000005,0.5,0.58499999999999996,0.38,"kW/ton",null,null,null,null,null,null,null,0.56000000000000005,0.5,0.58499999999999996,0.38]
[null,"WA-Water Cooled-Screw-1","WA","Water Cooled","Screw",1,"< 75 tons",0.75,0.6,0.78,0.5,"kW/ton",0.79,0.63200000000000001,443.38924926972516,49.053878122290939,{"$f":"P333/((M333-N333)/0.1)","v":31.046758305247423},null,null,0.75,0.6,0.78,0.5,"kW/ton"]
[null,"WA-Water Cooled-Screw-2","WA","Water Cooled","Screw",2,"≥ 75 tons and < 150 tons",0.72,0.56000000000000005,0.75,0.49,"kW/ton",0.79,0.63200000000000001,443.38924926972516,49.053878122290939,31.046758305247423,null,null,0.72,0.56000000000000005,0.75,0.49,"kW/ton"]
[null,"WA-Water Cooled-Screw-3","WA","Water Cooled","Screw",3,"≥ 150 tons and < 300 tons",0.66,0.54,0.68,0.44,"kW/ton",0.71799999999999997,0.57399999999999995,346.94119633464976,25.474144365156633,17.690378031358772,null,null,0.66,0.54,0.68,0.44,"kW/ton"]
[null,"WA-Water Cooled-Screw-4","WA","Water Cooled","Screw",4,"≥ 300 tons and < 600 tons",0.61,0.52,0.625,0.41,"kW/ton",0.63900000000000001,0.51100000000000001,275.83630822489715,11.398920686211682,8.9054067861028763,null,null,0.61,0.52,0.625,0.41,"kW/ton"]
[null,"WA-Water Cooled-Screw-5","WA","Water Cooled","Screw",5,"≥ 600 tons",0.56000000000000005,0.5,0.58499999999999996,0.38,"kW/ton",null,null,null,null,null,null,null,0.56000000000000005,0.5,0.58499999999999996,0.38]
[null,"WA-Water Cooled-Scroll-1","WA","Water Cooled","Scroll",1,"< 75 tons",0.75,0.6,0.78,0.5,"kW/ton",0.79,0.63200000000000001,443.38924926972516,49.053878122290939,{"$f":"P338/((M338-N338)/0.1)","v":31.046758305247423},null,null,0.75,0.6,0.78,0.5,"kW/ton"]
[null,"WA-Water Cooled-Scroll-2","WA","Water Cooled","Scroll",2,"≥ 75 tons and < 150 tons",0.72,0.56000000000000005,0.75,0.49,"kW/ton",0.79,0.63200000000000001,443.38924926972516,49.053878122290939,31.046758305247423,null,null,0.72,0.56000000000000005,0.75,0.49,"kW/ton"]
[null,"WA-Water Cooled-Scroll-3","WA","Water Cooled","Scroll",3,"≥ 150 tons and < 300 tons",0.66,0.54,0.68,0.44,"kW/ton",0.71799999999999997,0.57399999999999995,346.94119633464976,25.474144365156633,17.690378031358772,null,null,0.66,0.54,0.68,0.44,"kW/ton"]
[null,"WA-Water Cooled-Scroll-4","WA","Water Cooled","Scroll",4,"≥ 300 tons and < 600 tons",0.61,0.52,0.625,0.41,"kW/ton",0.63900000000000001,0.51100000000000001,275.83630822489715,11.398920686211682,8.9054067861028763,null,null,0.61,0.52,0.625,0.41,"kW/ton"]
[null,"WA-Water Cooled-Scroll-5","WA","Water Cooled","Scroll",5,"≥ 600 tons",0.56000000000000005,0.5,0.58499999999999996,0.38,"kW/ton",null,null,null,null,null,null,null,0.56000000000000005,0.5,0.58499999999999996,0.38]
[null,"WA-Water Cooled-Centrifugal-1","WA","Water Cooled","Centrifugal",1,"< 75 tons",0.61,0.55000000000000004,0.69499999999999995,0.44,"kW/ton",0.63400000000000001,0.56000000000000005,468.68792761740599,145.51913915158866,{"$f":"P343/((M343-N343)/0.1)","v":196.6474853399848},null,null,0.61,0.55000000000000004,0.69499999999999995,0.44,"kW/ton"]
[null,{"$f":"CONCATENATE(C344,\"-\",D344,\"-\",E344,\"-\",F344)","v":"WA-Water Cooled-Centrifugal-2"},"WA","Water Cooled","Centrifugal",2,"< 150 tons",0.61,0.55000000000000004,0.69499999999999995,0.44,"kW/ton",0.63400000000000001,0.56000000000000005,468.68792761740599,145.51913915158866,196.6474853399848,null,null,0.61,0.55000000000000004,0.69499999999999995,0.44,"kW/ton"]
[null,{"$f":"CONCATENATE(C345,\"-\",D345,\"-\",E345,\"-\",F345)","v":"WA-Water Cooled-Centrifugal-3"},"WA","Water Cooled","Centrifugal",3,"≥ 150 tons and < 300 tons",0.61,0.55000000000000004,0.69499999999999995,0.4,"kW/ton",0.63400000000000001,0.50700000000000001,338.7655378428837,93.841774058426779,73.891160675926599,null,null,0.61,0.55000000000000004,0.69499999999999995,0.4,"kW/ton"]
[null,"WA-Water Cooled-Centrifugal-4","WA","Water Cooled","Centrifugal",4,"≥ 300 tons and < 400 tons",0.56000000000000005,0.52,0.59499999999999997,0.39,"kW/ton",0.57599999999999996,0.46100000000000002,267.71423093494184,65.580715023103664,57.026708715742352,null,null,0.56000000000000005,0.52,0.59499999999999997,0.39,"kW/ton"]
[null,"WA-Water Cooled-Centrifugal-5","WA","Water Cooled","Centrifugal",5,"≥ 400 tons and < 600 tons",{"$f":"T347","v":0.56000000000000005},0.5,0.58499999999999996,0.38,"kW/ton",0.57599999999999996,0.46100000000000002,267.71423093494184,65.580715023103664,57.026708715742352,null,null,0.56000000000000005,0.5,0.58499999999999996,0.38,"kW/ton"]
[null,"WA-Water Cooled-Centrifugal-6","WA","Water Cooled","Centrifugal",6,"≥ 600 tons",{"$f":"T348","v":0.56000000000000005},0.5,0.58499999999999996,0.38,"kW/ton",null,null,null,null,null,null,null,0.56000000000000005,0.5,0.58499999999999996,0.38]

{"sheet":"Chiller Data (Original Copy)","index":8,"n_rows":325,"n_cols":29,"rows_kept":325,"cut":false,"hidden":true,"merged":[[195,2,195,23],[227,2,227,23],[259,2,259,23],[291,2,291,23],[3,2,3,23],[33,2,33,23],[63,2,63,23],[95,2,95,23],[131,2,131,23],[163,2,163,23]]}
[]
[]
[null,"Equipment ID","State","Heat Rejection","Type","Size","Size ID","Minimum COP (kW/ton)","Minimum IPLV (kW/ton)",null,null,"Unit","DEER Baseline Efficiency","DEER New Efficiency (kW/ton)","DEER Baseline cost","DEER Incremental Cost ($/ton)","($/ton/(0.1 kW/ton) increase)",null,null,"Minimum Full Load (COP)","Minimum IPLV (COP)",null,null,"Unit"]
[null,null,"Wyoming Chiller Data (IECC 2003)"]
[null,{"$f":"CONCATENATE(C5,\"-\",D5,\"-\",E5,\"-\",G5)","v":"WY-Air Cooled-Reciprocating-1"},"WY","Air Cooled","Reciprocating","<150 tons",1,{"$f":"12/(T5*3.412)","v":1.2560710098810921},1.2560710098810921,"Does Not Apply","Does Not Apply","kW/ton",1.26,1.008,448.95363636363641,39.935252525252508,{"$f":"P5/((M5-N5)/0.1)","v":15.847322430655757},null,null,2.8,2.8,"Does Not Apply","Does Not Apply","COP"]
[null,"WY-Air Cooled-Reciprocating-2","WY","Air Cooled","Reciprocating","≥150 tons and <300 tons",2,1.4067995310668231,1.4067995310668231,"Does Not Apply","Does Not Apply","kW/ton",1.26,1.008,448.95363636363641,39.935252525252508,15.847322430655757,null,null,2.5,2.5,"Does Not Apply","Does Not Apply","COP"]
[null,"WY-Air Cooled-Reciprocating-3","WY","Air Cooled","Reciprocating","≥300 tons",3,1.4067995310668231,1.4067995310668231,"Does Not Apply","Does Not Apply","kW/ton",1.26,1.008,448.95363636363641,39.935252525252508,15.847322430655757,null,null,2.5,2.5,"Does Not Apply","Does Not Apply","COP"]
[null,"WY-Air Cooled-Screw-1","WY","Air Cooled","Screw","<150 tons",1,1.2560710098810921,1.2560710098810921,"Does Not Apply","Does Not Apply","kW/ton",1.26,1.008,445.89673980058745,42.339587093587625,16.80142344983636,null,null,2.8,2.8,"Does Not Apply","Does Not Apply","COP"]
[null,"WY-Air Cooled-Screw-2","WY","Air Cooled","Screw","≥150 tons and <300 tons",2,1.4067995310668231,1.4067995310668231,"Does Not Apply","Does Not Apply","kW/ton",1.26,1.008,445.89673980058745,42.339587093587625,16.80142344983636,null,null,2.5,2.5,"Does Not Apply","Does Not Apply","COP"]
[null,"WY-Air Cooled-Screw-3","WY","Air Cooled","Screw","≥300 tons",3,1.4067995310668231,1.4067995310668231,"Does Not Apply","Does Not Apply","kW/ton",1.26,1.008,445.89673980058745,42.339587093587625,16.80142344983636,null,null,2.5,2.5,"Does Not Apply","Does Not Apply","COP"]
[null,"WY-Air Cooled-Scroll-1","WY","Air Cooled","Scroll","<150 tons",1,1.2560710098810921,1.2560710098810921,"Does Not Apply","Does Not Apply","kW/ton",1.26,1.008,445.89673980058745,42.339587093587625,16.80142344983636,null,null,2.8,2.8,"Does Not Apply","Does Not Apply","COP"]
[null,"WY-Air Cooled-Scroll-2","WY","Air Cooled","Scroll","≥150 tons and <300 tons",2,1.4067995310668231,1.4067995310668231,"Does Not Apply","Does Not Apply","kW/ton",1.26,1.008,445.89673980058745,42.339587093587625,16.80142344983636,null,null,2.5,2.5,"Does Not Apply","Does Not Apply","COP"]
[null,"WY-Air Cooled-Scroll-3","WY","Air Cooled","Scroll","≥300 tons",3,1.4067995310668231,1.4067995310668231,"Does Not Apply","Does Not Apply","kW/ton",1.26,1.008,445.89673980058745,42.339587093587625,16.80142344983636,null,null,2.5,2.5,"Does Not Apply","Does Not Apply","COP"]
[null,"WY-Air Cooled-Rotary-1","WY","Air Cooled","Rotary","<150 tons",1,1.2560710098810921,1.2560710098810921,"Does Not Apply","Does Not Apply","kW/ton",1.26,1.008,445.89673980058745,42.339587093587625,16.80142344983636,null,null,2.8,2.8,"Does Not Apply","Does Not Apply","COP"]
[null,"WY-Air Cooled-Rotary-2","WY","Air Cooled","Rotary","≥150 tons and <300 tons",2,1.4067995310668231,1.4067995310668231,"Does Not Apply","Does Not Apply","kW/ton",1.26,1.008,445.89673980058745,42.339587093587625,16.80142344983636,null,null,2.5,2.5,"Does Not Apply","Does Not Apply","COP"]
[null,"WY-Air Cooled-Rotary-3","WY","Air Cooled","Rotary","≥300 tons",3,1.4067995310668231,1.4067995310668231,"Does Not Apply","Does Not Apply","kW/ton",1.26,1.008,445.89673980058745,42.339587093587625,16.80142344983636,null,null,2.5,2.5,"Does Not Apply","Does Not Apply","COP"]
[null,"WY-Water Cooled-Reciprocating-1","WY","Water Cooled","Reciprocating","<150 tons",1,0.83738067325406129,0.75634383390689408,"Does Not Apply","Does Not Apply","kW/ton",0.83699999999999997,0.67200000000000004,462.58824239497829,16.274341238578074,9.8632371142897473,null,null,4.2,4.6500000000000004,"Does Not Apply","Does Not Apply","COP"]
[null,"WY-Water Cooled-Reciprocating-2","WY","Water Cooled","Reciprocating","≥150 tons and <300 tons",2,0.83738067325406129,0.75634383390689408,"Does Not Apply","Does Not Apply","kW/ton",0.83699999999999997,0.67200000000000004,462.58824239497829,16.274341238578074,9.8632371142897473,null,null,4.2,4.6500000000000004,"Does Not Apply","Does Not Apply","COP"]
[null,"WY-Water Cooled-Reciprocating-3","WY","Water Cooled","Reciprocating","≥300 tons",3,0.83738067325406129,0.75634383390689408,"Does Not Apply","Does Not Apply","kW/ton",0.83699999999999997,0.67200000000000004,462.58824239497829,16.274341238578074,9.8632371142897473,null,null,4.2,4.6500000000000004,"Does Not Apply","Does Not Apply","COP"]
[null,"WY-Water Cooled-Screw-1","WY","Water Cooled","Screw","<150 tons",1,0.79033681520608023,0.78155529503712395,"Does Not Apply","Does Not Apply","kW/ton",0.79,0.63200000000000001,443.38924926972516,49.053878122290939,31.046758305247423,null,null,4.45,4.5,"Does Not Apply","Does Not Apply","COP"]
[null,"WY-Water Cooled-Screw-2","WY","Water Cooled","Screw","≥150 tons and <300 tons",2,0.71775486278919531,0.71050481367011253,"Does Not Apply","Does Not Apply","kW/ton",0.71799999999999997,0.57399999999999995,346.94119633464976,25.474144365156633,17.690378031358772,null,null,4.9000000000000004,4.95,"Does Not Apply","Does Not Apply","COP"]
[null,"WY-Water Cooled-Screw-3","WY","Water Cooled","Screw","≥300 tons",3,0.63945433230310145,0.62803550494054605,"Does Not Apply","Does Not Apply","kW/ton",0.63900000000000001,0.51100000000000001,275.83630822489715,11.398920686211682,8.9054067861028763,null,null,5.5,5.6,"Does Not Apply","Does Not Apply","COP"]
[null,"WY-Water Cooled-Scroll-1","WY","Water Cooled","Scroll","<150 tons",1,0.79033681520608023,0.78155529503712395,"Does Not Apply","Does Not Apply","kW/ton",0.79,0.63200000000000001,443.38924926972516,49.053878122290939,31.046758305247423,null,null,4.45,4.5,"Does Not Apply","Does Not Apply","COP"]
[null,"WY-Water Cooled-Scroll-2","WY","Water Cooled","Scroll","≥150 tons and <300 tons",2,0.71775486278919531,0.71050481367011253,"Does Not Apply","Does Not Apply","kW/ton",0.71799999999999997,0.57399999999999995,346.94119633464976,25.474144365156633,17.690378031358772,null,null,4.9000000000000004,4.95,"Does Not Apply","Does Not Apply","COP"]
[null,"WY-Water Cooled-Scroll-3","WY","Water Cooled","Scroll","≥300 tons",3,0.63945433230310145,0.62803550494054605,"Does Not Apply","Does Not Apply","kW/ton",0.63900000000000001,0.51100000000000001,275.83630822489715,11.398920686211682,8.9054067861028763,null,null,5.5,5.6,"Does Not Apply","Does Not Apply","COP"]
[null,"WY-Water Cooled-Rotary-1","WY","Water Cooled","Rotary","<150 tons",1,0.79033681520608023,0.78155529503712395,"Does Not Apply","Does Not Apply","kW/ton",0.79,0.63200000000000001,443.38924926972516,49.053878122290939,31.046758305247423,null,null,4.45,4.5,"Does Not Apply","Does Not Apply","COP"]
[null,"WY-Water Cooled-Rotary-2","WY","Water Cooled","Rotary","≥150 tons and <300 tons",2,0.71775486278919531,0.71050481367011253,"Does Not Apply","Does Not Apply","kW/ton",0.71799999999999997,0.57399999999999995,346.94119633464976,25.474144365156633,17.690378031358772,null,null,4.9000000000000004,4.95,"Does Not Apply","Does Not Apply","COP"]
[null,"WY-Water Cooled-Rotary-3","WY","Water Cooled","Rotary","≥300 tons",3,0.63945433230310145,0.62803550494054605,"Does Not Apply","Does Not Apply","kW/ton",0.63900000000000001,0.51100000000000001,275.83630822489715,11.398920686211682,8.9054067861028763,null,null,5.5,5.6,"Does Not Apply","Does Not Apply","COP"]
[null,"WY-Water Cooled-Centrifugal-1","WY","Water Cooled","Centrifugal","<150 tons",1,0.70339976553341155,0.70339976553341155,"Does Not Apply","Does Not Apply","kW/ton",0.63400000000000001,0.56000000000000005,468.68792761740599,145.51913915158866,196.6474853399848,null,null,5,5,"Does Not Apply","Does Not Apply","COP"]
[null,"WY-Water Cooled-Centrifugal-2","WY","Water Cooled","Centrifugal","≥150 tons and <300 tons",2,0.63369348246253288,0.63369348246253288,"Does Not Apply","Does Not Apply","kW/ton",0.63400000000000001,0.50700000000000001,338.7655378428837,93.841774058426779,73.891160675926599,null,null,5.55,5.55,"Does Not Apply","Does Not Apply","COP"]
[null,"WY-Water Cooled-Centrifugal-3","WY","Water Cooled","Centrifugal","≥300 tons",3,0.57655718486345209,{"$f":"12/(U31*3.412)","v":0.57655718486345209},"Does Not Apply","Does Not Apply","kW/ton",0.57599999999999996,0.46100000000000002,267.71423093494184,65.580715023103664,57.026708715742352,null,null,6.1,6.1,"Does Not Apply","Does Not Apply","COP"]
[]
[null,"Equipment ID","State","Heat Rejection","Type","Size","Size ID","Minimum COP (kW/ton)","Minimum IPLV (kW/ton)",null,null,"Unit","DEER Baseline Efficiency","DEER New Efficiency (kW/ton)","DEER Baseline cost","DEER Incremental Cost ($/ton)","($/ton/(0.1 kW/ton) increase)",null,null,"Minimum Full Load (COP)","Minimum IPLV (COP)",null,null,"Unit"]
[null,null,"California Chiller Data (Title 24 - 2008)"]
[null,"CA-Air Cooled-Reciprocating-1","CA","Air Cooled","Reciprocating","<150 tons",1,{"$f":"12/(T35*3.412)","v":1.2560710098810921},{"$f":"12/(U35*3.412)","v":1.1531143697269042},"Does Not Apply","Does Not Apply","kW/ton",1.26,1.008,448.95363636363641,39.935252525252508,{"$f":"P35/((M35-N35)/0.1)","v":15.847322430655757},null,null,2.8,3.05,"Does Not Apply","Does Not Apply","COP"]
[null,"CA-Air Cooled-Reciprocating-2","CA","Air Cooled","Reciprocating","≥150 tons and <300 tons",2,{"$f":"12/(T36*3.412)","v":1.2560710098810921},1.1531143697269042,"Does Not Apply","Does Not Apply","kW/ton",1.26,1.008,448.95363636363641,39.935252525252508,15.847322430655757,null,null,2.8,3.05,"Does Not Apply","Does Not Apply","COP"]
[null,"CA-Air Cooled-Reciprocating-3","CA","Air Cooled","Reciprocating","≥300 tons",3,1.2560710098810921,1.1531143697269042,"Does Not Apply","Does Not Apply","kW/ton",1.26,1.008,448.95363636363641,39.935252525252508,15.847322430655757,null,null,2.8,3.05,"Does Not Apply","Does Not Apply","COP"]
[null,"CA-Air Cooled-Screw-1","CA","Air Cooled","Screw","<150 tons",1,1.2560710098810921,1.1531143697269042,"Does Not Apply","Does Not Apply","kW/ton",1.26,1.008,445.89673980058745,42.339587093587625,16.80142344983636,null,null,2.8,3.05,"Does Not Apply","Does Not Apply","COP"]
[null,"CA-Air Cooled-Screw-2","CA","Air Cooled","Screw","≥150 tons and <300 tons",2,1.2560710098810921,1.1531143697269042,"Does Not Apply","Does Not Apply","kW/ton",1.26,1.008,445.89673980058745,42.339587093587625,16.80142344983636,null,null,2.8,3.05,"Does Not Apply","Does Not Apply","COP"]
[null,"CA-Air Cooled-Screw-3","CA","Air Cooled","Screw","≥300 tons",3,1.2560710098810921,1.1531143697269042,"Does Not Apply","Does Not Apply","kW/ton",1.26,1.008,445.89673980058745,42.339587093587625,16.80142344983636,null,null,2.8,3.05,"Does Not Apply","Does Not Apply","COP"]
[null,"CA-Air Cooled-Scroll-1","CA","Air Cooled","Scroll","<150 tons",1,1.2560710098810921,1.1531143697269042,"Does Not Apply","Does Not Apply","kW/ton",1.26,1.008,445.89673980058745,42.339587093587625,16.80142344983636,null,null,2.8,3.05,"Does Not Apply","Does Not Apply","COP"]
[null,"CA-Air Cooled-Scroll-2","CA","Air Cooled","Scroll","≥150 tons and <300 tons",2,1.2560710098810921,1.1531143697269042,"Does Not Apply","Does Not Apply","kW/ton",1.26,1.008,445.89673980058745,42.339587093587625,16.80142344983636,null,null,2.8,3.05,"Does Not Apply","Does Not Apply","COP"]
[null,"CA-Air Cooled-Scroll-3","CA","Air Cooled","Scroll","≥300 tons",3,1.2560710098810921,1.1531143697269042,"Does Not Apply","Does Not Apply","kW/ton",1.26,1.008,445.89673980058745,42.339587093587625,16.80142344983636,null,null,2.8,3.05,"Does Not Apply","Does Not Apply","COP"]
[null,"CA-Air Cooled-Rotary-1","CA","Air Cooled","Rotary","<150 tons",1,1.2560710098810921,1.1531143697269042,"Does Not Apply","Does Not Apply","kW/ton",1.26,1.008,445.89673980058745,42.339587093587625,16.80142344983636,null,null,2.8,3.05,"Does Not Apply","Does Not Apply","COP"]
[null,"CA-Air Cooled-Rotary-2","CA","Air Cooled","Rotary","≥150 tons and <300 tons",2,1.2560710098810921,1.1531143697269042,"Does Not Apply","Does Not Apply","kW/ton",1.26,1.008,445.89673980058745,42.339587093587625,16.80142344983636,null,null,2.8,3.05,"Does Not Apply","Does Not Apply","COP"]
[null,"CA-Air Cooled-Rotary-3","CA","Air Cooled","Rotary","≥300 tons",3,1.2560710098810921,1.1531143697269042,"Does Not Apply","Does Not Apply","kW/ton",1.26,1.008,445.89673980058745,42.339587093587625,16.80142344983636,null,null,2.8,3.05,"Does Not Apply","Does Not Apply","COP"]
[null,"CA-Water Cooled-Reciprocating-1","CA","Water Cooled","Reciprocating","<150 tons",1,0.83738067325406129,0.69643541141921939,"Does Not Apply","Does Not Apply","kW/ton",0.83699999999999997,0.67200000000000004,462.58824239497829,16.274341238578074,9.8632371142897473,null,null,4.2,5.05,"Does Not Apply","Does Not Apply","COP"]
[null,"CA-Water Cooled-Reciprocating-2","CA","Water Cooled","Reciprocating","≥150 tons and <300 tons",2,0.83738067325406129,0.69643541141921939,"Does Not Apply","Does Not Apply","kW/ton",0.83699999999999997,0.67200000000000004,462.58824239497829,16.274341238578074,9.8632371142897473,null,null,4.2,5.05,"Does Not Apply","Does Not Apply","COP"]
[null,"CA-Water Cooled-Reciprocating-3","CA","Water Cooled","Reciprocating","≥300 tons",3,0.83738067325406129,0.69643541141921939,"Does Not Apply","Does Not Apply","kW/ton",0.83699999999999997,0.67200000000000004,462.58824239497829,16.274341238578074,9.8632371142897473,null,null,4.2,5.05,"Does Not Apply","Does Not Apply","COP"]
[null,"CA-Water Cooled-Screw-1","CA","Water Cooled","Screw","<150 tons",1,0.79033681520608023,0.67634592839751106,"Does Not Apply","Does Not Apply","kW/ton",0.79,0.63200000000000001,443.38924926972516,49.053878122290939,31.046758305247423,null,null,4.45,5.2,"Does Not Apply","Does Not Apply","COP"]
[null,"CA-Water Cooled-Screw-2","CA","Water Cooled","Screw","≥150 tons and <300 tons",2,0.71775486278919531,0.62803550494054605,"Does Not Apply","Does Not Apply","kW/ton",0.71799999999999997,0.57399999999999995,346.94119633464976,25.474144365156633,17.690378031358772,null,null,4.9000000000000004,5.6,"Does Not Apply","Does Not Apply","COP"]
[null,"CA-Water Cooled-Screw-3","CA","Water Cooled","Screw","≥300 tons",3,0.63945433230310145,0.57186972807594427,"Does Not Apply","Does Not Apply","kW/ton",0.63900000000000001,0.51100000000000001,275.83630822489715,11.398920686211682,8.9054067861028763,null,null,5.5,6.15,"Does Not Apply","Does Not Apply","COP"]
[null,"CA-Water Cooled-Scroll-1","CA","Water Cooled","Scroll","<150 tons",1,0.79033681520608023,0.67634592839751106,"Does Not Apply","Does Not Apply","kW/ton",0.79,0.63200000000000001,443.38924926972516,49.053878122290939,31.046758305247423,null,null,4.45,5.2,"Does Not Apply","Does Not Apply","COP"]
[null,"CA-Water Cooled-Scroll-2","CA","Water Cooled","Scroll","≥150 tons and <300 tons",2,0.71775486278919531,0.62803550494054605,"Does Not Apply","Does Not Apply","kW/ton",0.71799999999999997,0.57399999999999995,346.94119633464976,25.474144365156633,17.690378031358772,null,null,4.9000000000000004,5.6,"Does Not Apply","Does Not Apply","COP"]
[null,"CA-Water Cooled-Scroll-3","CA","Water Cooled","Scroll","≥300 tons",3,0.63945433230310145,0.57186972807594427,"Does Not Apply","Does Not Apply","kW/ton",0.63900000000000001,0.51100000000000001,275.83630822489715,11.398920686211682,8.9054067861028763,null,null,5.5,6.15,"Does Not Apply","Does Not Apply","COP"]
[null,"CA-Water Cooled-Rotary-1","CA","Water Cooled","Rotary","<150 tons",1,0.79033681520608023,0.67634592839751106,"Does Not Apply","Does Not Apply","kW/ton",0.79,0.63200000000000001,443.38924926972516,49.053878122290939,31.046758305247423,null,null,4.45,5.2,"Does Not Apply","Does Not Apply","COP"]
[null,"CA-Water Cooled-Rotary-2","CA","Water Cooled","Rotary","≥150 tons and <300 tons",2,0.71775486278919531,0.62803550494054605,"Does Not Apply","Does Not Apply","kW/ton",0.71799999999999997,0.57399999999999995,346.94119633464976,25.474144365156633,17.690378031358772,null,null,4.9000000000000004,5.6,"Does Not Apply","Does Not Apply","COP"]
[null,"CA-Water Cooled-Rotary-3","CA","Water Cooled","Rotary","≥300 tons",3,0.63945433230310145,0.57186972807594427,"Does Not Apply","Does Not Apply","kW/ton",0.63900000000000001,0.51100000000000001,275.83630822489715,11.398920686211682,8.9054067861028763,null,null,5.5,6.15,"Does Not Apply","Does Not Apply","COP"]
[null,"CA-Water Cooled-Centrifugal-1","CA","Water Cooled","Centrifugal","<150 tons",1,0.70339976553341155,0.66990453860324906,"Does Not Apply","Does Not Apply","kW/ton",0.63400000000000001,0.56000000000000005,468.68792761740599,145.51913915158866,196.6474853399848,null,null,5,5.25,"Does Not Apply","Does Not Apply","COP"]
[null,"CA-Water Cooled-Centrifugal-2","CA","Water Cooled","Centrifugal","≥150 tons and <300 tons",2,0.63369348246253288,0.5961014962147555,"Does Not Apply","Does Not Apply","kW/ton",0.63400000000000001,0.50700000000000001,338.7655378428837,93.841774058426779,73.891160675926599,null,null,5.55,5.9,"Does Not Apply","Does Not Apply","COP"]
[null,"CA-Water Cooled-Centrifugal-3","CA","Water Cooled","Centrifugal","≥300 tons",3,0.57655718486345209,0.5495310668229777,"Does Not Apply","Does Not Apply","kW/ton",0.57599999999999996,0.46100000000000002,267.71423093494184,65.580715023103664,57.026708715742352,null,null,6.1,6.4,"Does Not Apply","Does Not Apply","COP"]
[]
[null,"Equipment ID","State","Heat Rejection","Type","Size","Size ID","Minimum COP (kW/ton)","Minimum IPLV (kW/ton)",null,null,"Unit","DEER Baseline Efficiency","DEER New Efficiency (kW/ton)","DEER Baseline cost","DEER Incremental Cost ($/ton)","($/ton/(0.1 kW/ton) increase)",null,null,"Minimum Full Load (COP)","Minimum IPLV (COP)",null,null,"Unit"]
[null,null,"UTAH Chiller Data (IECC 2012) - Effective July 1, 2014"]
[null,{"$f":"CONCATENATE(C65,\"-\",D65,\"-\",E65,\"-\",F65)","v":"UT-Air Cooled-Reciprocating-1"},"UT","Air Cooled","Reciprocating",1,"< 150 tons",{"$f":"12/T65","v":1.2549675800041833},{"$f":"12/U65","v":0.96},"NA","NA","kW/ton",1.26,1.008,448.95363636363641,39.935252525252508,{"$f":"P65/((M65-N65)/0.1)","v":15.847322430655757},null,null,9.5619999999999994,12.5,"NA","NA","EER"]
[null,{"$f":"CONCATENATE(C66,\"-\",D66,\"-\",E66,\"-\",F66)","v":"UT-Air Cooled-Reciprocating-2"},"UT","Air Cooled","Reciprocating",2,"≥ 150 tons",{"$f":"12/T66","v":1.2549675800041833},0.94117647058823528,"NA","NA","kW/ton",1.26,1.008,448.95363636363641,39.935252525252508,15.847322430655757,null,null,9.5619999999999994,12.75,"NA","NA","EER"]
[null,"UT-Air Cooled-Rotary-1","UT","Air Cooled","Rotary",1,"< 150 tons",1.2549675800041833,0.96,"NA","NA","kW/ton",1.26,1.008,448.95363636363641,39.935252525252508,15.847322430655757,null,null,9.5619999999999994,12.5,"NA","NA","EER"]
[null,"UT-Air Cooled-Rotary-2","UT","Air Cooled","Rotary",2,"≥ 150 tons",1.2549675800041833,0.94117647058823528,"NA","NA","kW/ton",1.26,1.008,448.95363636363641,39.935252525252508,15.847322430655757,null,null,9.5619999999999994,12.75,"NA","NA","EER"]
[null,"UT-Air Cooled-Screw-1","UT","Air Cooled","Screw",1,"< 150 tons",1.2549675800041833,0.96,"NA","NA","kW/ton",1.26,1.008,448.95363636363641,39.935252525252508,15.847322430655757,null,null,9.5619999999999994,12.5,"NA","NA","EER"]
[null,"UT-Air Cooled-Screw-2","UT","Air Cooled","Screw",2,"≥ 150 tons",1.2549675800041833,0.94117647058823528,"NA","NA","kW/ton",1.26,1.008,448.95363636363641,39.935252525252508,15.847322430655757,null,null,9.5619999999999994,12.75,"NA","NA","EER"]
[null,"UT-Air Cooled-Scroll-1","UT","Air Cooled","Scroll",1,"< 150 tons",1.2549675800041833,0.96,"NA","NA","kW/ton",1.26,1.008,448.95363636363641,39.935252525252508,15.847322430655757,null,null,9.5619999999999994,12.5,"NA","NA","EER"]
[null,"UT-Air Cooled-Scroll-2","UT","Air Cooled","Scroll",2,"≥ 150 tons",1.2549675800041833,0.94117647058823528,"NA","NA","kW/ton",1.26,1.008,448.95363636363641,39.935252525252508,15.847322430655757,null,null,9.5619999999999994,12.75,"NA","NA","EER"]
[null,"UT-Water Cooled-Reciprocating-1","UT","Water Cooled","Reciprocating",1,"< 75 tons",0.78,0.63,0.8,0.6,"kW/ton",0.83699999999999997,0.67200000000000004,462.58824239497829,16.274341238578074,9.8632371142897473,null,null,0.78,0.63,0.8,0.6,"kW/ton"]
[null,"UT-Water Cooled-Reciprocating-2","UT","Water Cooled","Reciprocating",2,"≥ 75 tons and < 150 tons",0.77500000000000002,0.61499999999999999,0.79,0.58599999999999997,"kW/ton",0.83699999999999997,0.67200000000000004,462.58824239497829,16.274341238578074,9.8632371142897473,null,null,0.77500000000000002,0.61499999999999999,0.79,0.58599999999999997,"kW/ton"]
[null,"UT-Water Cooled-Reciprocating-3","UT","Water Cooled","Reciprocating",3,"≥ 150 tons and < 300 tons",0.68,0.57999999999999996,0.71799999999999997,0.54,"kW/ton",0.83699999999999997,0.67200000000000004,462.58824239497829,16.274341238578074,9.8632371142897473,null,null,0.68,0.57999999999999996,0.71799999999999997,0.54,"kW/ton"]
[null,"UT-Water Cooled-Reciprocating-4","UT","Water Cooled","Reciprocating",4,"≥ 300 tons",0.62,0.54,0.63900000000000001,0.49,"kW/ton",0.83699999999999997,0.67200000000000004,462.58824239497829,16.274341238578074,{"$f":"P76/((M76-N76)/0.1)","v":9.8632371142897473},null,null,0.62,0.54,0.63900000000000001,0.49,"kW/ton"]
[null,"UT-Water Cooled-Rotary-1","UT","Water Cooled","Rotary",1,"< 75 tons",0.78,0.63,0.8,0.6,"kW/ton",0.79,0.63200000000000001,443.38924926972516,49.053878122290939,{"$f":"P77/((M77-N77)/0.1)","v":31.046758305247423},null,null,0.78,0.63,0.8,0.6,"kW/ton"]
[null,"UT-Water Cooled-Rotary-2","UT","Water Cooled","Rotary",2,"≥ 75 tons and < 150 tons",0.77500000000000002,0.61499999999999999,0.79,0.58599999999999997,"kW/ton",0.79,0.63200000000000001,443.38924926972516,49.053878122290939,{"$f":"P78/((M78-N78)/0.1)","v":31.046758305247423},null,null,0.77500000000000002,0.61499999999999999,0.79,0.58599999999999997,"kW/ton"]
[null,"UT-Water Cooled-Rotary-3","UT","Water Cooled","Rotary",3,"≥ 150 tons and < 300 tons",0.68,0.57999999999999996,0.71799999999999997,0.54,"kW/ton",0.71799999999999997,0.57399999999999995,346.94119633464976,25.474144365156633,{"$f":"P79/((M79-N79)/0.1)","v":17.690378031358772},null,null,0.68,0.57999999999999996,0.71799999999999997,0.54,"kW/ton"]
[null,"UT-Water Cooled-Rotary-4","UT","Water Cooled","Rotary",4,"≥ 300 tons",0.62,0.54,0.63900000000000001,0.49,"kW/ton",0.63900000000000001,0.51100000000000001,275.83630822489715,11.398920686211682,{"$f":"P80/((M80-N80)/0.1)","v":8.9054067861028763},null,null,0.62,0.54,0.63900000000000001,0.49,"kW/ton"]
[null,"UT-Water Cooled-Screw-1","UT","Water Cooled","Screw",1,"< 75 tons",0.78,0.63,0.8,0.6,"kW/ton",0.79,0.63200000000000001,443.38924926972516,49.053878122290939,{"$f":"P81/((M81-N81)/0.1)","v":31.046758305247423},null,null,0.78,0.63,0.8,0.6,"kW/ton"]
[null,"UT-Water Cooled-Screw-2","UT","Water Cooled","Screw",2,"≥ 75 tons and < 150 tons",0.77500000000000002,0.61499999999999999,0.79,0.58599999999999997,"kW/ton",0.79,0.63200000000000001,443.38924926972516,49.053878122290939,31.046758305247423,null,null,0.77500000000000002,0.61499999999999999,0.79,0.58599999999999997,"kW/ton"]
[null,"UT-Water Cooled-Screw-3","UT","Water Cooled","Screw",3,"≥ 150 tons and < 300 tons",0.68,0.57999999999999996,0.71799999999999997,0.54,"kW/ton",0.71799999999999997,0.57399999999999995,346.94119633464976,25.474144365156633,17.690378031358772,null,null,0.68,0.57999999999999996,0.71799999999999997,0.54,"kW/ton"]
[null,"UT-Water Cooled-Screw-4","UT","Water Cooled","Screw",4,"≥ 300 tons",0.62,0.54,0.63900000000000001,0.49,"kW/ton",0.63900000000000001,0.51100000000000001,275.83630822489715,11.398920686211682,8.9054067861028763,null,null,0.62,0.54,0.63900000000000001,0.49,"kW/ton"]
[null,"UT-Water Cooled-Scroll-1","UT","Water Cooled","Scroll",1,"< 75 tons",0.78,0.63,0.8,0.6,"kW/ton",0.79,0.63200000000000001,443.38924926972516,49.053878122290939,31.046758305247423,null,null,0.78,0.63,0.8,0.6,"kW/ton"]
[null,"UT-Water Cooled-Scroll-2","UT","Water Cooled","Scroll",2,"≥ 75 tons and < 150 tons",0.77500000000000002,0.61499999999999999,0.79,0.58599999999999997,"kW/ton",0.79,0.63200000000000001,443.38924926972516,49.053878122290939,31.046758305247423,null,null,0.77500000000000002,0.61499999999999999,0.79,0.58599999999999997,"kW/ton"]
[null,"UT-Water Cooled-Scroll-3","UT","Water Cooled","Scroll",3,"≥ 150 tons and < 300 tons",0.68,0.57999999999999996,0.71799999999999997,0.54,"kW/ton",0.71799999999999997,0.57399999999999995,346.94119633464976,25.474144365156633,17.690378031358772,null,null,0.68,0.57999999999999996,0.71799999999999997,0.54,"kW/ton"]
[null,"UT-Water Cooled-Scroll-4","UT","Water Cooled","Scroll",4,"≥ 300 tons",0.62,0.54,0.63900000000000001,0.49,"kW/ton",0.63900000000000001,0.51100000000000001,275.83630822489715,11.398920686211682,8.9054067861028763,null,null,0.62,0.54,0.63900000000000001,0.49,"kW/ton"]
[null,"UT-Water Cooled-Centrifugal-1","UT","Water Cooled","Centrifugal",1,"< 75 tons",0.63400000000000001,0.59599999999999997,0.63900000000000001,0.45,"kW/ton",0.63400000000000001,0.56000000000000005,468.68792761740599,145.51913915158866,196.6474853399848,null,null,0.63400000000000001,0.59599999999999997,0.63900000000000001,0.45,"kW/ton"]
[null,{"$f":"CONCATENATE(C90,\"-\",D90,\"-\",E90,\"-\",F90)","v":"UT-Water Cooled-Centrifugal-2"},"UT","Water Cooled","Centrifugal",2,"< 150 tons",0.63400000000000001,0.59599999999999997,0.63900000000000001,0.45,"kW/ton",0.63400000000000001,0.56000000000000005,468.68792761740599,145.51913915158866,196.6474853399848,null,null,0.63400000000000001,0.59599999999999997,0.63900000000000001,0.45,"kW/ton"]
[null,{"$f":"CONCATENATE(C91,\"-\",D91,\"-\",E91,\"-\",F91)","v":"UT-Water Cooled-Centrifugal-3"},"UT","Water Cooled","Centrifugal",3,"≥ 150 tons and < 300 tons",0.63400000000000001,0.59599999999999997,0.63900000000000001,0.45,"kW/ton",0.63400000000000001,0.50700000000000001,338.7655378428837,93.841774058426779,73.891160675926599,null,null,0.63400000000000001,0.59599999999999997,0.63900000000000001,0.45,"kW/ton"]
[null,"UT-Water Cooled-Centrifugal-4","UT","Water Cooled","Centrifugal",4,"≥ 300 tons and < 600 tons",0.57599999999999996,0.54900000000000004,0.6,0.4,"kW/ton",0.57599999999999996,0.46100000000000002,267.71423093494184,65.580715023103664,57.026708715742352,null,null,0.57599999999999996,0.54900000000000004,0.6,0.4,"kW/ton"]
[null,"UT-Water Cooled-Centrifugal-5","UT","Water Cooled","Centrifugal",5,"≥ 600 tons",0.56999999999999995,0.53900000000000003,0.59,0.4,"kW/ton",0.57599999999999996,0.46100000000000002,267.71423093494184,65.580715023103664,57.026708715742352,null,null,0.56999999999999995,0.53900000000000003,0.59,0.4,"kW/ton"]
[]
[null,"Equipment ID","State","Heat Rejection","Type","Size","Size ID","Minimum COP (kW/ton)","Minimum IPLV (kW/ton)",null,null,"Unit","DEER Baseline Efficiency","DEER New Efficiency (kW/ton)","DEER Baseline cost","DEER Incremental Cost ($/ton)","($/ton/(0.1 kW/ton) increase)",null,null,"Minimum Full Load (COP)","Minimum IPLV (COP)",null,null,"Unit"]
[null,null,"UTAH Chiller Data (IECC 2015) - Effective July 1, 2016"]
[null,{"$f":"CONCATENATE(C97,\"-\",D97,\"-\",E97,\"-\",F97)","v":"UT-Air Cooled-Reciprocating-A"},"UT","Air Cooled","Reciprocating","A","< 150 tons",1.1881188118811881,0.87591240875912413,1.2371134020618557,0.75949367088607589,"kW/ton",1.26,1.008,448.95363636363641,39.935252525252508,{"$f":"P97/((M97-N97)/0.1)","v":15.847322430655757},null,null,9.5619999999999994,12.5,"NA","NA","EER",null,{"$f":"IF(H97='Chiller Data'!H176,\"2015 & 2021 Same\",\"Not Same\")","v":"2015 & 2021 Same"},{"$f":"IF(I97='Chiller Data'!I176,\"2015 & 2021 Same\",\"Not Same\")","v":"2015 & 2021 Same"},{"$f":"IF(J97='Chiller Data'!J176,\"2015 & 2021 Same\",\"Not Same\")","v":"2015 & 2021 Same"},{"$f":"IF(K97='Chiller Data'!K176,\"2015 & 2021 Same\",\"Not Same\")","v":"2015 & 2021 Same"}]
[null,{"$f":"CONCATENATE(C98,\"-\",D98,\"-\",E98,\"-\",F98)","v":"UT-Air Cooled-Reciprocating-B"},"UT","Air Cooled","Reciprocating","B","≥ 150 tons",1.1881188118811881,0.8571428571428571,1.2371134020618557,0.74534161490683226,"kW/ton",1.26,1.008,448.95363636363641,39.935252525252508,15.847322430655757,null,null,9.5619999999999994,12.75,"NA","NA","EER",null,{"$f":"IF(H98='Chiller Data'!H177,\"2015 & 2021 Same\",\"Not Same\")","v":"2015 & 2021 Same"},{"$f":"IF(I98='Chiller Data'!I177,\"2015 & 2021 Same\",\"Not Same\")","v":"2015 & 2021 Same"},{"$f":"IF(J98='Chiller Data'!J177,\"2015 & 2021 Same\",\"Not Same\")","v":"2015 & 2021 Same"},{"$f":"IF(K98='Chiller Data'!K177,\"2015 & 2021 Same\",\"Not Same\")","v":"2015 & 2021 Same"}]
[null,"UT-Air Cooled-Rotary-A","UT","Air Cooled","Rotary","A","< 150 tons",1.1881188118811881,0.87591240875912413,1.2371134020618557,0.75949367088607589,"kW/ton",1.26,1.008,448.95363636363641,39.935252525252508,15.847322430655757,null,null,9.5619999999999994,12.5,"NA","NA","EER",null,{"$f":"IF(H99='Chiller Data'!H178,\"2015 & 2021 Same\",\"Not Same\")","v":"2015 & 2021 Same"},{"$f":"IF(I99='Chiller Data'!I178,\"2015 & 2021 Same\",\"Not Same\")","v":"2015 & 2021 Same"},{"$f":"IF(J99='Chiller Data'!J178,\"2015 & 2021 Same\",\"Not Same\")","v":"2015 & 2021 Same"},{"$f":"IF(K99='Chiller Data'!K178,\"2015 & 2021 Same\",\"Not Same\")","v":"2015 & 2021 Same"}]
[null,"UT-Air Cooled-Rotary-B","UT","Air Cooled","Rotary","B","≥ 150 tons",1.1881188118811881,0.8571428571428571,1.2371134020618557,0.74534161490683226,"kW/ton",1.26,1.008,448.95363636363641,39.935252525252508,15.847322430655757,null,null,9.5619999999999994,12.75,"NA","NA","EER",null,{"$f":"IF(H100='Chiller Data'!H179,\"2015 & 2021 Same\",\"Not Same\")","v":"2015 & 2021 Same"},{"$f":"IF(I100='Chiller Data'!I179,\"2015 & 2021 Same\",\"Not Same\")","v":"2015 & 2021 Same"},{"$f":"IF(J100='Chiller Data'!J179,\"2015 & 2021 Same\",\"Not Same\")","v":"2015 & 2021 Same"},{"$f":"IF(K100='Chiller Data'!K179,\"2015 & 2021 Same\",\"Not Same\")","v":"2015 & 2021 Same"}]
[null,"UT-Air Cooled-Screw-A","UT","Air Cooled","Screw","A","< 150 tons",1.1881188118811881,0.87591240875912413,1.2371134020618557,0.75949367088607589,"kW/ton",1.26,1.008,448.95363636363641,39.935252525252508,15.847322430655757,null,null,9.5619999999999994,12.5,"NA","NA","EER",null,{"$f":"IF(H101='Chiller Data'!H180,\"2015 & 2021 Same\",\"Not Same\")","v":"2015 & 2021 Same"},{"$f":"IF(I101='Chiller Data'!I180,\"2015 & 2021 Same\",\"Not Same\")","v":"2015 & 2021 Same"},{"$f":"IF(J101='Chiller Data'!J180,\"2015 & 2021 Same\",\"Not Same\")","v":"2015 & 2021 Same"},{"$f":"IF(K101='Chiller Data'!K180,\"2015 & 2021 Same\",\"Not Same\")","v":"2015 & 2021 Same"}]
[null,"UT-Air Cooled-Screw-B","UT","Air Cooled","Screw","B","≥ 150 tons",1.1881188118811881,0.8571428571428571,1.2371134020618557,0.74534161490683226,"kW/ton",1.26,1.008,448.95363636363641,39.935252525252508,15.847322430655757,null,null,9.5619999999999994,12.75,"NA","NA","EER",null,{"$f":"IF(H102='Chiller Data'!H181,\"2015 & 2021 Same\",\"Not Same\")","v":"2015 & 2021 Same"},{"$f":"IF(I102='Chiller Data'!I181,\"2015 & 2021 Same\",\"Not Same\")","v":"2015 & 2021 Same"},{"$f":"IF(J102='Chiller Data'!J181,\"2015 & 2021 Same\",\"Not Same\")","v":"2015 & 2021 Same"},{"$f":"IF(K102='Chiller Data'!K181,\"2015 & 2021 Same\",\"Not Same\")","v":"2015 & 2021 Same"}]
[null,"UT-Air Cooled-Scroll-A","UT","Air Cooled","Scroll","A","< 150 tons",1.1881188118811881,0.87591240875912413,1.2371134020618557,0.75949367088607589,"kW/ton",1.26,1.008,448.95363636363641,39.935252525252508,15.847322430655757,null,null,9.5619999999999994,12.5,"NA","NA","EER",null,{"$f":"IF(H103='Chiller Data'!H182,\"2015 & 2021 Same\",\"Not Same\")","v":"2015 & 2021 Same"},{"$f":"IF(I103='Chiller Data'!I182,\"2015 & 2021 Same\",\"Not Same\")","v":"2015 & 2021 Same"},{"$f":"IF(J103='Chiller Data'!J182,\"2015 & 2021 Same\",\"Not Same\")","v":"2015 & 2021 Same"},{"$f":"IF(K103='Chiller Data'!K182,\"2015 & 2021 Same\",\"Not Same\")","v":"2015 & 2021 Same"}]
[null,"UT-Air Cooled-Scroll-B","UT","Air Cooled","Scroll","B","≥ 150 tons",1.1881188118811881,0.8571428571428571,1.2371134020618557,0.74534161490683226,"kW/ton",1.26,1.008,448.95363636363641,39.935252525252508,15.847322430655757,null,null,9.5619999999999994,12.75,"NA","NA","EER",null,{"$f":"IF(H104='Chiller Data'!H183,\"2015 & 2021 Same\",\"Not Same\")","v":"2015 & 2021 Same"},{"$f":"IF(I104='Chiller Data'!I183,\"2015 & 2021 Same\",\"Not Same\")","v":"2015 & 2021 Same"},{"$f":"IF(J104='Chiller Data'!J183,\"2015 & 2021 Same\",\"Not Same\")","v":"2015 & 2021 Same"},{"$f":"IF(K104='Chiller Data'!K183,\"2015 & 2021 Same\",\"Not Same\")","v":"2015 & 2021 Same"}]
[null,"UT-Water Cooled-Reciprocating-A","UT","Water Cooled","Reciprocating","A","< 75 tons",0.75,0.6,0.78,0.5,"kW/ton",0.83699999999999997,0.67200000000000004,462.58824239497829,16.274341238578074,9.8632371142897473,null,null,0.78,0.63,0.8,0.6,"kW/ton",null,{"$f":"IF(H105='Chiller Data'!H184,\"2015 & 2021 Same\",\"Not Same\")","v":"2015 & 2021 Same"},{"$f":"IF(I105='Chiller Data'!I184,\"2015 & 2021 Same\",\"Not Same\")","v":"2015 & 2021 Same"},{"$f":"IF(J105='Chiller Data'!J184,\"2015 & 2021 Same\",\"Not Same\")","v":"2015 & 2021 Same"},{"$f":"IF(K105='Chiller Data'!K184,\"2015 & 2021 Same\",\"Not Same\")","v":"2015 & 2021 Same"}]
[null,"UT-Water Cooled-Reciprocating-B","UT","Water Cooled","Reciprocating","B","≥ 75 tons and < 150 tons",0.72,0.56000000000000005,0.75,0.49,"kW/ton",0.83699999999999997,0.67200000000000004,462.58824239497829,16.274341238578074,9.8632371142897473,null,null,0.77500000000000002,0.61499999999999999,0.79,0.58599999999999997,"kW/ton",null,{"$f":"IF(H106='Chiller Data'!H185,\"2015 & 2021 Same\",\"Not Same\")","v":"2015 & 2021 Same"},{"$f":"IF(I106='Chiller Data'!I185,\"2015 & 2021 Same\",\"Not Same\")","v":"2015 & 2021 Same"},{"$f":"IF(J106='Chiller Data'!J185,\"2015 & 2021 Same\",\"Not Same\")","v":"2015 & 2021 Same"},{"$f":"IF(K106='Chiller Data'!K185,\"2015 & 2021 Same\",\"Not Same\")","v":"2015 & 2021 Same"}]
[null,"UT-Water Cooled-Reciprocating-C","UT","Water Cooled","Reciprocating","C","≥ 150 tons and < 300 tons",0.66,0.54,0.68,0.44,"kW/ton",0.83699999999999997,0.67200000000000004,462.58824239497829,16.274341238578074,9.8632371142897473,null,null,0.68,0.57999999999999996,0.71799999999999997,0.54,"kW/ton",null,{"$f":"IF(H107='Chiller Data'!H186,\"2015 & 2021 Same\",\"Not Same\")","v":"2015 & 2021 Same"},{"$f":"IF(I107='Chiller Data'!I186,\"2015 & 2021 Same\",\"Not Same\")","v":"2015 & 2021 Same"},{"$f":"IF(J107='Chiller Data'!J186,\"2015 & 2021 Same\",\"Not Same\")","v":"2015 & 2021 Same"},{"$f":"IF(K107='Chiller Data'!K186,\"2015 & 2021 Same\",\"Not Same\")","v":"2015 & 2021 Same"}]
[null,"UT-Water Cooled-Reciprocating-D","UT","Water Cooled","Reciprocating","D","≥ 300 tons and < 600 tons",0.61,0.52,0.625,0.41,"kW/ton",0.83699999999999997,0.67200000000000004,462.58824239497829,16.274341238578074,{"$f":"P108/((M108-N108)/0.1)","v":9.8632371142897473},null,null,0.62,0.54,0.63900000000000001,0.49,"kW/ton",null,{"$f":"IF(H108='Chiller Data'!H187,\"2015 & 2021 Same\",\"Not Same\")","v":"2015 & 2021 Same"},{"$f":"IF(I108='Chiller Data'!I187,\"2015 & 2021 Same\",\"Not Same\")","v":"2015 & 2021 Same"},{"$f":"IF(J108='Chiller Data'!J187,\"2015 & 2021 Same\",\"Not Same\")","v":"2015 & 2021 Same"},{"$f":"IF(K108='Chiller Data'!K187,\"2015 & 2021 Same\",\"Not Same\")","v":"2015 & 2021 Same"}]
[null,"UT-Water Cooled-Reciprocating-E","UT","Water Cooled","Reciprocating","E","≥ 600 tons",0.56000000000000005,0.5,0.58499999999999996,0.38,"kW/ton",null,null,null,null,null,null,null,null,null,null,null,null,null,{"$f":"IF(H109='Chiller Data'!H188,\"2015 & 2021 Same\",\"Not Same\")","v":"2015 & 2021 Same"},{"$f":"IF(I109='Chiller Data'!I188,\"2015 & 2021 Same\",\"Not Same\")","v":"2015 & 2021 Same"},{"$f":"IF(J109='Chiller Data'!J188,\"2015 & 2021 Same\",\"Not Same\")","v":"2015 & 2021 Same"},{"$f":"IF(K109='Chiller Data'!K188,\"2015 & 2021 Same\",\"Not Same\")","v":"2015 & 2021 Same"}]
[null,"UT-Water Cooled-Rotary-A","UT","Water Cooled","Rotary","A","< 75 tons",0.75,0.6,0.78,0.5,"kW/ton",0.79,0.63200000000000001,443.38924926972516,49.053878122290939,{"$f":"P110/((M110-N110)/0.1)","v":31.046758305247423},null,null,0.78,0.63,0.8,0.6,"kW/ton",null,{"$f":"IF(H110='Chiller Data'!H189,\"2015 & 2021 Same\",\"Not Same\")","v":"2015 & 2021 Same"},{"$f":"IF(I110='Chiller Data'!I189,\"2015 & 2021 Same\",\"Not Same\")","v":"2015 & 2021 Same"},{"$f":"IF(J110='Chiller Data'!J189,\"2015 & 2021 Same\",\"Not Same\")","v":"2015 & 2021 Same"},{"$f":"IF(K110='Chiller Data'!K189,\"2015 & 2021 Same\",\"Not Same\")","v":"2015 & 2021 Same"}]
[null,"UT-Water Cooled-Rotary-B","UT","Water Cooled","Rotary","B","≥ 75 tons and < 150 tons",0.72,0.56000000000000005,0.75,0.49,"kW/ton",0.79,0.63200000000000001,443.38924926972516,49.053878122290939,{"$f":"P111/((M111-N111)/0.1)","v":31.046758305247423},null,null,0.77500000000000002,0.61499999999999999,0.79,0.58599999999999997,"kW/ton",null,{"$f":"IF(H111='Chiller Data'!H190,\"2015 & 2021 Same\",\"Not Same\")","v":"2015 & 2021 Same"},{"$f":"IF(I111='Chiller Data'!I190,\"2015 & 2021 Same\",\"Not Same\")","v":"2015 & 2021 Same"},{"$f":"IF(J111='Chiller Data'!J190,\"2015 & 2021 Same\",\"Not Same\")","v":"2015 & 2021 Same"},{"$f":"IF(K111='Chiller Data'!K190,\"2015 & 2021 Same\",\"Not Same\")","v":"2015 & 2021 Same"}]
[null,"UT-Water Cooled-Rotary-C","UT","Water Cooled","Rotary","C","≥ 150 tons and < 300 tons",0.66,0.54,0.68,0.44,"kW/ton",0.71799999999999997,0.57399999999999995,346.94119633464976,25.474144365156633,{"$f":"P112/((M112-N112)/0.1)","v":17.690378031358772},null,null,0.68,0.57999999999999996,0.71799999999999997,0.54,"kW/ton",null,{"$f":"IF(H112='Chiller Data'!H191,\"2015 & 2021 Same\",\"Not Same\")","v":"2015 & 2021 Same"},{"$f":"IF(I112='Chiller Data'!I191,\"2015 & 2021 Same\",\"Not Same\")","v":"2015 & 2021 Same"},{"$f":"IF(J112='Chiller Data'!J191,\"2015 & 2021 Same\",\"Not Same\")","v":"2015 & 2021 Same"},{"$f":"IF(K112='Chiller Data'!K191,\"2015 & 2021 Same\",\"Not Same\")","v":"2015 & 2021 Same"}]
[null,"UT-Water Cooled-Rotary-D","UT","Water Cooled","Rotary","D","≥ 300 tons and < 600 tons",0.61,0.52,0.625,0.41,"kW/ton",0.63900000000000001,0.51100000000000001,275.83630822489715,11.398920686211682,{"$f":"P113/((M113-N113)/0.1)","v":8.9054067861028763},null,null,0.62,0.54,0.63900000000000001,0.49,"kW/ton",null,{"$f":"IF(H113='Chiller Data'!H192,\"2015 & 2021 Same\",\"Not Same\")","v":"2015 & 2021 Same"},{"$f":"IF(I113='Chiller Data'!I192,\"2015 & 2021 Same\",\"Not Same\")","v":"2015 & 2021 Same"},{"$f":"IF(J113='Chiller Data'!J192,\"2015 & 2021 Same\",\"Not Same\")","v":"2015 & 2021 Same"},{"$f":"IF(K113='Chiller Data'!K192,\"2015 & 2021 Same\",\"Not Same\")","v":"2015 & 2021 Same"}]
[null,"UT-Water Cooled-Rotary-E","UT","Water Cooled","Rotary","E","≥ 600 tons",0.56000000000000005,0.5,0.58499999999999996,0.38,"kW/ton",null,null,null,null,null,null,null,null,null,null,null,null,null,{"$f":"IF(H114='Chiller Data'!H193,\"2015 & 2021 Same\",\"Not Same\")","v":"2015 & 2021 Same"},{"$f":"IF(I114='Chiller Data'!I193,\"2015 & 2021 Same\",\"Not Same\")","v":"2015 & 2021 Same"},{"$f":"IF(J114='Chiller Data'!J193,\"2015 & 2021 Same\",\"Not Same\")","v":"2015 & 2021 Same"},{"$f":"IF(K114='Chiller Data'!K193,\"2015 & 2021 Same\",\"Not Same\")","v":"2015 & 2021 Same"}]
[null,"UT-Water Cooled-Screw-A","UT","Water Cooled","Screw","A","< 75 tons",0.75,0.6,0.78,0.5,"kW/ton",0.79,0.63200000000000001,443.38924926972516,49.053878122290939,{"$f":"P115/((M115-N115)/0.1)","v":31.046758305247423},null,null,0.78,0.63,0.8,0.6,"kW/ton",null,{"$f":"IF(H115='Chiller Data'!H194,\"2015 & 2021 Same\",\"Not Same\")","v":"2015 & 2021 Same"},{"$f":"IF(I115='Chiller Data'!I194,\"2015 & 2021 Same\",\"Not Same\")","v":"2015 & 2021 Same"},{"$f":"IF(J115='Chiller Data'!J194,\"2015 & 2021 Same\",\"Not Same\")","v":"2015 & 2021 Same"},{"$f":"IF(K115='Chiller Data'!K194,\"2015 & 2021 Same\",\"Not Same\")","v":"2015 & 2021 Same"}]
[null,"UT-Water Cooled-Screw-B","UT","Water Cooled","Screw","B","≥ 75 tons and < 150 tons",0.72,0.56000000000000005,0.75,0.49,"kW/ton",0.79,0.63200000000000001,443.38924926972516,49.053878122290939,31.046758305247423,null,null,0.77500000000000002,0.61499999999999999,0.79,0.58599999999999997,"kW/ton",null,{"$f":"IF(H116='Chiller Data'!H195,\"2015 & 2021 Same\",\"Not Same\")","v":"2015 & 2021 Same"},{"$f":"IF(I116='Chiller Data'!I195,\"2015 & 2021 Same\",\"Not Same\")","v":"2015 & 2021 Same"},{"$f":"IF(J116='Chiller Data'!J195,\"2015 & 2021 Same\",\"Not Same\")","v":"2015 & 2021 Same"},{"$f":"IF(K116='Chiller Data'!K195,\"2015 & 2021 Same\",\"Not Same\")","v":"2015 & 2021 Same"}]
[null,"UT-Water Cooled-Screw-C","UT","Water Cooled","Screw","C","≥ 150 tons and < 300 tons",0.66,0.54,0.68,0.44,"kW/ton",0.71799999999999997,0.57399999999999995,346.94119633464976,25.474144365156633,17.690378031358772,null,null,0.68,0.57999999999999996,0.71799999999999997,0.54,"kW/ton",null,{"$f":"IF(H117='Chiller Data'!H196,\"2015 & 2021 Same\",\"Not Same\")","v":"2015 & 2021 Same"},{"$f":"IF(I117='Chiller Data'!I196,\"2015 & 2021 Same\",\"Not Same\")","v":"2015 & 2021 Same"},{"$f":"IF(J117='Chiller Data'!J196,\"2015 & 2021 Same\",\"Not Same\")","v":"2015 & 2021 Same"},{"$f":"IF(K117='Chiller Data'!K196,\"2015 & 2021 Same\",\"Not Same\")","v":"2015 & 2021 Same"}]
[null,"UT-Water Cooled-Screw-D","UT","Water Cooled","Screw","D","≥ 300 tons and < 600 tons",0.61,0.52,0.625,0.41,"kW/ton",0.63900000000000001,0.51100000000000001,275.83630822489715,11.398920686211682,8.9054067861028763,null,null,0.62,0.54,0.63900000000000001,0.49,"kW/ton",null,{"$f":"IF(H118='Chiller Data'!H197,\"2015 & 2021 Same\",\"Not Same\")","v":"2015 & 2021 Same"},{"$f":"IF(I118='Chiller Data'!I197,\"2015 & 2021 Same\",\"Not Same\")","v":"2015 & 2021 Same"},{"$f":"IF(J118='Chiller Data'!J197,\"2015 & 2021 Same\",\"Not Same\")","v":"2015 & 2021 Same"},{"$f":"IF(K118='Chiller Data'!K197,\"2015 & 2021 Same\",\"Not Same\")","v":"2015 & 2021 Same"}]
[null,"UT-Water Cooled-Screw-E","UT","Water Cooled","Screw","E","≥ 600 tons",0.56000000000000005,0.5,0.58499999999999996,0.38,"kW/ton",null,null,null,null,null,null,null,null,null,null,null,null,null,{"$f":"IF(H119='Chiller Data'!H198,\"2015 & 2021 Same\",\"Not Same\")","v":"2015 & 2021 Same"},{"$f":"IF(I119='Chiller Data'!I198,\"2015 & 2021 Same\",\"Not Same\")","v":"2015 & 2021 Same"},{"$f":"IF(J119='Chiller Data'!J198,\"2015 & 2021 Same\",\"Not Same\")","v":"2015 & 2021 Same"},{"$f":"IF(K119='Chiller Data'!K198,\"2015 & 2021 Same\",\"Not Same\")","v":"2015 & 2021 Same"}]
[null,"UT-Water Cooled-Scroll-A","UT","Water Cooled","Scroll","A","< 75 tons",0.75,0.6,0.78,0.5,"kW/ton",0.79,0.63200000000000001,443.38924926972516,49.053878122290939,31.046758305247423,null,null,0.78,0.63,0.8,0.6,"kW/ton",null,{"$f":"IF(H120='Chiller Data'!H199,\"2015 & 2021 Same\",\"Not Same\")","v":"2015 & 2021 Same"},{"$f":"IF(I120='Chiller Data'!I199,\"2015 & 2021 Same\",\"Not Same\")","v":"2015 & 2021 Same"},{"$f":"IF(J120='Chiller Data'!J199,\"2015 & 2021 Same\",\"Not Same\")","v":"2015 & 2021 Same"},{"$f":"IF(K120='Chiller Data'!K199,\"2015 & 2021 Same\",\"Not Same\")","v":"2015 & 2021 Same"}]
[null,"UT-Water Cooled-Scroll-B","UT","Water Cooled","Scroll","B","≥ 75 tons and < 150 tons",0.72,0.56000000000000005,0.75,0.49,"kW/ton",0.79,0.63200000000000001,443.38924926972516,49.053878122290939,31.046758305247423,null,null,0.77500000000000002,0.61499999999999999,0.79,0.58599999999999997,"kW/ton",null,{"$f":"IF(H121='Chiller Data'!H200,\"2015 & 2021 Same\",\"Not Same\")","v":"2015 & 2021 Same"},{"$f":"IF(I121='Chiller Data'!I200,\"2015 & 2021 Same\",\"Not Same\")","v":"2015 & 2021 Same"},{"$f":"IF(J121='Chiller Data'!J200,\"2015 & 2021 Same\",\"Not Same\")","v":"2015 & 2021 Same"},{"$f":"IF(K121='Chiller Data'!K200,\"2015 & 2021 Same\",\"Not Same\")","v":"2015 & 2021 Same"}]
[null,"UT-Water Cooled-Scroll-C","UT","Water Cooled","Scroll","C","≥ 150 tons and < 300 tons",0.66,0.54,0.68,0.44,"kW/ton",0.71799999999999997,0.57399999999999995,346.94119633464976,25.474144365156633,17.690378031358772,null,null,0.68,0.57999999999999996,0.71799999999999997,0.54,"kW/ton",null,{"$f":"IF(H122='Chiller Data'!H201,\"2015 & 2021 Same\",\"Not Same\")","v":"2015 & 2021 Same"},{"$f":"IF(I122='Chiller Data'!I201,\"2015 & 2021 Same\",\"Not Same\")","v":"2015 & 2021 Same"},{"$f":"IF(J122='Chiller Data'!J201,\"2015 & 2021 Same\",\"Not Same\")","v":"2015 & 2021 Same"},{"$f":"IF(K122='Chiller Data'!K201,\"2015 & 2021 Same\",\"Not Same\")","v":"2015 & 2021 Same"}]
[null,"UT-Water Cooled-Scroll-D","UT","Water Cooled","Scroll","D","≥ 300 tons and < 600 tons",0.61,0.52,0.625,0.41,"kW/ton",0.63900000000000001,0.51100000000000001,275.83630822489715,11.398920686211682,8.9054067861028763,null,null,0.62,0.54,0.63900000000000001,0.49,"kW/ton",null,{"$f":"IF(H123='Chiller Data'!H202,\"2015 & 2021 Same\",\"Not Same\")","v":"2015 & 2021 Same"},{"$f":"IF(I123='Chiller Data'!I202,\"2015 & 2021 Same\",\"Not Same\")","v":"2015 & 2021 Same"},{"$f":"IF(J123='Chiller Data'!J202,\"2015 & 2021 Same\",\"Not Same\")","v":"2015 & 2021 Same"},{"$f":"IF(K123='Chiller Data'!K202,\"2015 & 2021 Same\",\"Not Same\")","v":"2015 & 2021 Same"}]
[null,"UT-Water Cooled-Scroll-E","UT","Water Cooled","Scroll","E","≥ 600 tons",0.56000000000000005,0.5,0.58499999999999996,0.38,"kW/ton",null,null,null,null,null,null,null,null,null,null,null,null,null,{"$f":"IF(H124='Chiller Data'!H203,\"2015 & 2021 Same\",\"Not Same\")","v":"2015 & 2021 Same"},{"$f":"IF(I124='Chiller Data'!I203,\"2015 & 2021 Same\",\"Not Same\")","v":"2015 & 2021 Same"},{"$f":"IF(J124='Chiller Data'!J203,\"2015 & 2021 Same\",\"Not Same\")","v":"2015 & 2021 Same"},{"$f":"IF(K124='Chiller Data'!K203,\"2015 & 2021 Same\",\"Not Same\")","v":"2015 & 2021 Same"}]
[null,"UT-Water Cooled-Centrifugal-A","UT","Water Cooled","Centrifugal","A","< 75 tons",0.63400000000000001,0.59599999999999997,0.63900000000000001,0.45,"kW/ton",0.63400000000000001,0.56000000000000005,468.68792761740599,145.51913915158866,196.6474853399848,null,null,0.63400000000000001,0.59599999999999997,0.63900000000000001,0.45,"kW/ton",null,{"$f":"IF(H125='Chiller Data'!H204,\"2015 & 2021 Same\",\"Not Same\")","v":"Not Same"},{"$f":"IF(I125='Chiller Data'!I204,\"2015 & 2021 Same\",\"Not Same\")","v":"Not Same"},{"$f":"IF(J125='Chiller Data'!J204,\"2015 & 2021 Same\",\"Not Same\")","v":"Not Same"},{"$f":"IF(K125='Chiller Data'!K204,\"2015 & 2021 Same\",\"Not Same\")","v":"Not Same"}]
[null,{"$f":"CONCATENATE(C126,\"-\",D126,\"-\",E126,\"-\",F126)","v":"UT-Water Cooled-Centrifugal-B"},"UT","Water Cooled","Centrifugal","B","< 150 tons",0.61,0.55000000000000004,0.69499999999999995,0.44,"kW/ton",0.63400000000000001,0.56000000000000005,468.68792761740599,145.51913915158866,196.6474853399848,null,null,0.63400000000000001,0.59599999999999997,0.63900000000000001,0.45,"kW/ton",null,{"$f":"IF(H126='Chiller Data'!H205,\"2015 & 2021 Same\",\"Not Same\")","v":"2015 & 2021 Same"},{"$f":"IF(I126='Chiller Data'!I205,\"2015 & 2021 Same\",\"Not Same\")","v":"2015 & 2021 Same"},{"$f":"IF(J126='Chiller Data'!J205,\"2015 & 2021 Same\",\"Not Same\")","v":"2015 & 2021 Same"},{"$f":"IF(K126='Chiller Data'!K205,\"2015 & 2021 Same\",\"Not Same\")","v":"2015 & 2021 Same"}]
[null,"UT-Water Cooled-Centrifugal-C","UT","Water Cooled","Centrifugal","C","≥ 150 tons and < 300 tons",0.61,0.55000000000000004,0.63500000000000001,0.4,"kW/ton",0.63400000000000001,0.50700000000000001,338.7655378428837,93.841774058426779,73.891160675926599,null,null,0.63400000000000001,0.59599999999999997,0.63900000000000001,0.45,"kW/ton",null,{"$f":"IF(H127='Chiller Data'!H206,\"2015 & 2021 Same\",\"Not Same\")","v":"2015 & 2021 Same"},{"$f":"IF(I127='Chiller Data'!I206,\"2015 & 2021 Same\",\"Not Same\")","v":"2015 & 2021 Same"},{"$f":"IF(J127='Chiller Data'!J206,\"2015 & 2021 Same\",\"Not Same\")","v":"2015 & 2021 Same"},{"$f":"IF(K127='Chiller Data'!K206,\"2015 & 2021 Same\",\"Not Same\")","v":"2015 & 2021 Same"}]
[null,"UT-Water Cooled-Centrifugal-D","UT","Water Cooled","Centrifugal","D","≥ 300 tons and < 400 tons",0.56000000000000005,0.52,0.59499999999999997,0.39,"kW/ton",0.57599999999999996,0.46100000000000002,267.71423093494184,65.580715023103664,57.026708715742352,null,null,0.57599999999999996,0.54900000000000004,0.6,0.4,"kW/ton",null,{"$f":"IF(H128='Chiller Data'!H207,\"2015 & 2021 Same\",\"Not Same\")","v":"2015 & 2021 Same"},{"$f":"IF(I128='Chiller Data'!I207,\"2015 & 2021 Same\",\"Not Same\")","v":"2015 & 2021 Same"},{"$f":"IF(J128='Chiller Data'!J207,\"2015 & 2021 Same\",\"Not Same\")","v":"2015 & 2021 Same"},{"$f":"IF(K128='Chiller Data'!K207,\"2015 & 2021 Same\",\"Not Same\")","v":"2015 & 2021 Same"}]
[null,"UT-Water Cooled-Centrifugal-E","UT","Water Cooled","Centrifugal","E","≥ 400 tons",0.56000000000000005,0.5,0.58499999999999996,0.38,"kW/ton",0.57599999999999996,0.46100000000000002,267.71423093494184,65.580715023103664,57.026708715742352,null,null,0.56999999999999995,0.53900000000000003,0.59,0.4,"kW/ton",null,{"$f":"IF(H129='Chiller Data'!H208,\"2015 & 2021 Same\",\"Not Same\")","v":"2015 & 2021 Same"},{"$f":"IF(I129='Chiller Data'!I208,\"2015 & 2021 Same\",\"Not Same\")","v":"2015 & 2021 Same"},{"$f":"IF(J129='Chiller Data'!J208,\"2015 & 2021 Same\",\"Not Same\")","v":"2015 & 2021 Same"},{"$f":"IF(K129='Chiller Data'!K208,\"2015 & 2021 Same\",\"Not Same\")","v":"2015 & 2021 Same"}]
[]
[null,"Equipment ID","State","Heat Rejection","Type","Size","Size ID","Minimum COP (kW/ton)","Minimum IPLV (kW/ton)",null,null,"Unit","DEER Baseline Efficiency","DEER New Efficiency (kW/ton)","DEER Baseline cost","DEER Incremental Cost ($/ton)","($/ton/(0.1 kW/ton) increase)",null,null,"Minimum Full Load (COP)","Minimum IPLV (COP)",null,null,"Unit"]
[null,null,"Washington Chiller Data (WSEC 2012) - Effective July 1, 2013"]
[null,"WA-Air Cooled-Reciprocating-1","WA","Air Cooled","Reciprocating",1,"< 150 tons",{"$f":"12/T133","v":1.2549675800041833},{"$f":"12/U133","v":0.96},"NA","NA","kW/ton",1.26,1.008,448.95363636363641,39.935252525252508,15.847322430655757,null,null,9.5619999999999994,12.5,"NA","NA","EER"]
[null,"WA-Air Cooled-Reciprocating-2","WA","Air Cooled","Reciprocating",2,"≥ 150 tons",{"$f":"12/T134","v":1.2549675800041833},0.94117647058823528,"NA","NA","kW/ton",1.26,1.008,448.95363636363641,39.935252525252508,15.847322430655757,null,null,9.5619999999999994,12.75,"NA","NA","EER"]
[null,"WA-Air Cooled-Rotary-1","WA","Air Cooled","Rotary",1,"< 150 tons",1.2549675800041833,0.96,"NA","NA","kW/ton",1.26,1.008,448.95363636363641,39.935252525252508,15.847322430655757,null,null,9.5619999999999994,12.5,"NA","NA","EER"]
[null,"WA-Air Cooled-Rotary-2","WA","Air Cooled","Rotary",2,"≥ 150 tons",1.2549675800041833,0.94117647058823528,"NA","NA","kW/ton",1.26,1.008,448.95363636363641,39.935252525252508,15.847322430655757,null,null,9.5619999999999994,12.75,"NA","NA","EER"]
[null,"WA-Air Cooled-Screw-1","WA","Air Cooled","Screw",1,"< 150 tons",1.2549675800041833,0.96,"NA","NA","kW/ton",1.26,1.008,448.95363636363641,39.935252525252508,15.847322430655757,null,null,9.5619999999999994,12.5,"NA","NA","EER"]
[null,"WA-Air Cooled-Screw-2","WA","Air Cooled","Screw",2,"≥ 150 tons",1.2549675800041833,0.94117647058823528,"NA","NA","kW/ton",1.26,1.008,448.95363636363641,39.935252525252508,15.847322430655757,null,null,9.5619999999999994,12.75,"NA","NA","EER"]
[null,"WA-Air Cooled-Scroll-1","WA","Air Cooled","Scroll",1,"< 150 tons",1.2549675800041833,0.96,"NA","NA","kW/ton",1.26,1.008,448.95363636363641,39.935252525252508,15.847322430655757,null,null,9.5619999999999994,12.5,"NA","NA","EER"]
[null,"WA-Air Cooled-Scroll-2","WA","Air Cooled","Scroll",2,"≥ 150 tons",1.2549675800041833,0.94117647058823528,"NA","NA","kW/ton",1.26,1.008,448.95363636363641,39.935252525252508,15.847322430655757,null,null,9.5619999999999994,12.75,"NA","NA","EER"]
[null,"WA-Water Cooled-Reciprocating-1","WA","Water Cooled","Reciprocating",1,"< 75 tons",0.78,0.63,0.8,0.6,"kW/ton",0.83699999999999997,0.67200000000000004,462.58824239497829,16.274341238578074,9.8632371142897473,null,null,0.78,0.63,0.8,0.6,"kW/ton"]
[null,"WA-Water Cooled-Reciprocating-2","WA","Water Cooled","Reciprocating",2,"≥ 75 tons and < 150 tons",0.77500000000000002,0.61499999999999999,0.79,0.58599999999999997,"kW/ton",0.83699999999999997,0.67200000000000004,462.58824239497829,16.274341238578074,9.8632371142897473,null,null,0.77500000000000002,0.61499999999999999,0.79,0.58599999999999997,"kW/ton"]
[null,"WA-Water Cooled-Reciprocating-3","WA","Water Cooled","Reciprocating",3,"≥ 150 tons and < 300 tons",0.68,0.57999999999999996,0.71799999999999997,0.54,"kW/ton",0.83699999999999997,0.67200000000000004,462.58824239497829,16.274341238578074,9.8632371142897473,null,null,0.68,0.57999999999999996,0.71799999999999997,0.54,"kW/ton"]
[null,"WA-Water Cooled-Reciprocating-4","WA","Water Cooled","Reciprocating",4,"≥ 300 tons",0.62,0.54,0.63900000000000001,0.49,"kW/ton",0.83699999999999997,0.67200000000000004,462.58824239497829,16.274341238578074,9.8632371142897473,null,null,0.62,0.54,0.63900000000000001,0.49,"kW/ton"]
[null,"WA-Water Cooled-Rotary-1","WA","Water Cooled","Rotary",1,"< 75 tons",0.78,0.63,0.8,0.6,"kW/ton",0.79,0.63200000000000001,443.38924926972516,49.053878122290939,31.046758305247423,null,null,0.78,0.63,0.8,0.6,"kW/ton"]
[null,"WA-Water Cooled-Rotary-2","WA","Water Cooled","Rotary",2,"≥ 75 tons and < 150 tons",0.77500000000000002,0.61499999999999999,0.79,0.58599999999999997,"kW/ton",0.79,0.63200000000000001,443.38924926972516,49.053878122290939,31.046758305247423,null,null,0.77500000000000002,0.61499999999999999,0.79,0.58599999999999997,"kW/ton"]
[null,"WA-Water Cooled-Rotary-3","WA","Water Cooled","Rotary",3,"≥ 150 tons and < 300 tons",0.68,0.57999999999999996,0.71799999999999997,0.54,"kW/ton",0.71799999999999997,0.57399999999999995,346.94119633464976,25.474144365156633,17.690378031358772,null,null,0.68,0.57999999999999996,0.71799999999999997,0.54,"kW/ton"]
[null,"WA-Water Cooled-Rotary-4","WA","Water Cooled","Rotary",4,"≥ 300 tons",0.62,0.54,0.63900000000000001,0.49,"kW/ton",0.63900000000000001,0.51100000000000001,275.83630822489715,11.398920686211682,8.9054067861028763,null,null,0.62,0.54,0.63900000000000001,0.49,"kW/ton"]
[null,"WA-Water Cooled-Screw-1","WA","Water Cooled","Screw",1,"< 75 tons",0.78,0.63,0.8,0.6,"kW/ton",0.79,0.63200000000000001,443.38924926972516,49.053878122290939,31.046758305247423,null,null,0.78,0.63,0.8,0.6,"kW/ton"]
[null,"WA-Water Cooled-Screw-2","WA","Water Cooled","Screw",2,"≥ 75 tons and < 150 tons",0.77500000000000002,0.61499999999999999,0.79,0.58599999999999997,"kW/ton",0.79,0.63200000000000001,443.38924926972516,49.053878122290939,31.046758305247423,null,null,0.77500000000000002,0.61499999999999999,0.79,0.58599999999999997,"kW/ton"]
[null,"WA-Water Cooled-Screw-3","WA","Water Cooled","Screw",3,"≥ 150 tons and < 300 tons",0.68,0.57999999999999996,0.71799999999999997,0.54,"kW/ton",0.71799999999999997,0.57399999999999995,346.94119633464976,25.474144365156633,17.690378031358772,null,null,0.68,0.57999999999999996,0.71799999999999997,0.54,"kW/ton"]
[null,"WA-Water Cooled-Screw-4","WA","Water Cooled","Screw",4,"≥ 300 tons",0.62,0.54,0.63900000000000001,0.49,"kW/ton",0.63900000000000001,0.51100000000000001,275.83630822489715,11.398920686211682,8.9054067861028763,null,null,0.62,0.54,0.63900000000000001,0.49,"kW/ton"]
[null,"WA-Water Cooled-Scroll-1","WA","Water Cooled","Scroll",1,"< 75 tons",0.78,0.63,0.8,0.6,"kW/ton",0.79,0.63200000000000001,443.38924926972516,49.053878122290939,31.046758305247423,null,null,0.78,0.63,0.8,0.6,"kW/ton"]
[null,"WA-Water Cooled-Scroll-2","WA","Water Cooled","Scroll",2,"≥ 75 tons and < 150 tons",0.77500000000000002,0.61499999999999999,0.79,0.58599999999999997,"kW/ton",0.79,0.63200000000000001,443.38924926972516,49.053878122290939,31.046758305247423,null,null,0.77500000000000002,0.61499999999999999,0.79,0.58599999999999997,"kW/ton"]
[null,{"$f":"CONCATENATE(C155,\"-\",D155,\"-\",E155,\"-\",F155)","v":"WA-Water Cooled-Scroll-3"},"WA","Water Cooled","Scroll",3,"≥ 150 tons and < 300 tons",0.68,0.57999999999999996,0.71799999999999997,0.54,"kW/ton",0.71799999999999997,0.57399999999999995,346.94119633464976,25.474144365156633,17.690378031358772,null,null,0.68,0.57999999999999996,0.71799999999999997,0.54,"kW/ton"]
[null,"WA-Water Cooled-Scroll-4","WA","Water Cooled","Scroll",4,"≥ 300 tons",0.62,0.54,0.63900000000000001,0.49,"kW/ton",0.63900000000000001,0.51100000000000001,275.83630822489715,11.398920686211682,8.9054067861028763,null,null,0.62,0.54,0.63900000000000001,0.49,"kW/ton"]
[null,"WA-Water Cooled-Centrifugal-1","WA","Water Cooled","Centrifugal",1,"< 75 tons",0.63400000000000001,0.59599999999999997,0.63900000000000001,0.45,"kW/ton",0.63400000000000001,0.56000000000000005,468.68792761740599,145.51913915158866,196.6474853399848,null,null,0.63400000000000001,0.59599999999999997,0.63900000000000001,0.45,"kW/ton"]
[null,{"$f":"CONCATENATE(C158,\"-\",D158,\"-\",E158,\"-\",F158)","v":"WA-Water Cooled-Centrifugal-2"},"WA","Water Cooled","Centrifugal",2,"< 150 tons",0.63400000000000001,0.59599999999999997,0.63900000000000001,0.45,"kW/ton",0.63400000000000001,0.56000000000000005,468.68792761740599,145.51913915158866,196.6474853399848,null,null,0.63400000000000001,0.59599999999999997,0.63900000000000001,0.45,"kW/ton"]
[null,"WA-Water Cooled-Centrifugal-3","WA","Water Cooled","Centrifugal",3,"≥ 150 tons and < 300 tons",0.63400000000000001,0.59599999999999997,0.63900000000000001,0.45,"kW/ton",0.63400000000000001,0.50700000000000001,338.7655378428837,93.841774058426779,73.891160675926599,null,null,0.63400000000000001,0.59599999999999997,0.63900000000000001,0.45,"kW/ton"]
[null,"WA-Water Cooled-Centrifugal-4","WA","Water Cooled","Centrifugal",4,"≥ 300 tons and < 600 tons",0.57599999999999996,0.54900000000000004,0.6,0.4,"kW/ton",0.57599999999999996,0.46100000000000002,267.71423093494184,65.580715023103664,57.026708715742352,null,null,0.57599999999999996,0.54900000000000004,0.6,0.4,"kW/ton"]
[null,"WA-Water Cooled-Centrifugal-5","WA","Water Cooled","Centrifugal",5,"≥ 600 tons",0.56999999999999995,0.53900000000000003,0.59,0.4,"kW/ton",0.57599999999999996,0.46100000000000002,267.71423093494184,65.580715023103664,57.026708715742352,null,null,0.56999999999999995,0.53900000000000003,0.59,0.4,"kW/ton"]
[]
[null,"Equipment ID","State","Heat Rejection","Type","Size","Size ID","Minimum COP (kW/ton)","Minimum IPLV (kW/ton)",null,null,"Unit","DEER Baseline Efficiency","DEER New Efficiency (kW/ton)","DEER Baseline cost","DEER Incremental Cost ($/ton)","($/ton/(0.1 kW/ton) increase)",null,null,"Minimum Full Load (COP)","Minimum IPLV (COP)",null,null,"Unit"]
[null,null,"IDAHO Chiller Data (IECC 2009) - Effective Jan. 1, 2011"]
[null,{"$f":"CONCATENATE(C165,\"-\",D165,\"-\",E165,\"-\",F165)","v":"ID-Air Cooled-Reciprocating-1"},"ID","Air Cooled","Reciprocating",1,"< 150 tons",{"$f":"12/T165","v":1.2549675800041833},{"$f":"12/U165","v":0.96},"NA","NA","kW/ton",1.26,1.008,448.95363636363641,39.935252525252508,{"$f":"P165/((M165-N165)/0.1)","v":15.847322430655757},null,null,9.5619999999999994,12.5,"NA","NA","EER"]
[null,{"$f":"CONCATENATE(C166,\"-\",D166,\"-\",E166,\"-\",F166)","v":"ID-Air Cooled-Reciprocating-2"},"ID","Air Cooled","Reciprocating",2,"≥ 150 tons",{"$f":"12/T166","v":1.2549675800041833},0.94117647058823528,"NA","NA","kW/ton",1.26,1.008,448.95363636363641,39.935252525252508,15.847322430655757,null,null,9.5619999999999994,12.75,"NA","NA","EER"]
[null,"ID-Air Cooled-Rotary-1","ID","Air Cooled","Rotary",1,"< 150 tons",1.2549675800041833,0.96,"NA","NA","kW/ton",1.26,1.008,448.95363636363641,39.935252525252508,15.847322430655757,null,null,9.5619999999999994,12.5,"NA","NA","EER"]
[null,"ID-Air Cooled-Rotary-2","ID","Air Cooled","Rotary",2,"≥ 150 tons",1.2549675800041833,0.94117647058823528,"NA","NA","kW/ton",1.26,1.008,448.95363636363641,39.935252525252508,15.847322430655757,null,null,9.5619999999999994,12.75,"NA","NA","EER"]
[null,"ID-Air Cooled-Screw-1","ID","Air Cooled","Screw",1,"< 150 tons",1.2549675800041833,0.96,"NA","NA","kW/ton",1.26,1.008,448.95363636363641,39.935252525252508,15.847322430655757,null,null,9.5619999999999994,12.5,"NA","NA","EER"]
[null,"ID-Air Cooled-Screw-2","ID","Air Cooled","Screw",2,"≥ 150 tons",1.2549675800041833,0.94117647058823528,"NA","NA","kW/ton",1.26,1.008,448.95363636363641,39.935252525252508,15.847322430655757,null,null,9.5619999999999994,12.75,"NA","NA","EER"]
[null,"ID-Air Cooled-Scroll-1","ID","Air Cooled","Scroll",1,"< 150 tons",1.2549675800041833,0.96,"NA","NA","kW/ton",1.26,1.008,448.95363636363641,39.935252525252508,15.847322430655757,null,null,9.5619999999999994,12.5,"NA","NA","EER"]
[null,"ID-Air Cooled-Scroll-2","ID","Air Cooled","Scroll",2,"≥ 150 tons",1.2549675800041833,0.94117647058823528,"NA","NA","kW/ton",1.26,1.008,448.95363636363641,39.935252525252508,15.847322430655757,null,null,9.5619999999999994,12.75,"NA","NA","EER"]
[null,"ID-Water Cooled-Reciprocating-1","ID","Water Cooled","Reciprocating",1,"< 75 tons",0.78,0.63,0.8,0.6,"kW/ton",0.83699999999999997,0.67200000000000004,462.58824239497829,16.274341238578074,9.8632371142897473,null,null,0.78,0.63,0.8,0.6,"kW/ton"]
[null,"ID-Water Cooled-Reciprocating-2","ID","Water Cooled","Reciprocating",2,"≥ 75 tons and < 150 tons",0.77500000000000002,0.61499999999999999,0.79,0.58599999999999997,"kW/ton",0.83699999999999997,0.67200000000000004,462.58824239497829,16.274341238578074,9.8632371142897473,null,null,0.77500000000000002,0.61499999999999999,0.79,0.58599999999999997,"kW/ton"]
[null,"ID-Water Cooled-Reciprocating-3","ID","Water Cooled","Reciprocating",3,"≥ 150 tons and < 300 tons",0.68,0.57999999999999996,0.71799999999999997,0.54,"kW/ton",0.83699999999999997,0.67200000000000004,462.58824239497829,16.274341238578074,9.8632371142897473,null,null,0.68,0.57999999999999996,0.71799999999999997,0.54,"kW/ton"]
[null,"ID-Water Cooled-Reciprocating-4","ID","Water Cooled","Reciprocating",4,"≥ 300 tons",0.62,0.54,0.63900000000000001,0.49,"kW/ton",0.83699999999999997,0.67200000000000004,462.58824239497829,16.274341238578074,{"$f":"P176/((M176-N176)/0.1)","v":9.8632371142897473},null,null,0.62,0.54,0.63900000000000001,0.49,"kW/ton"]
[null,"ID-Water Cooled-Rotary-1","ID","Water Cooled","Rotary",1,"< 75 tons",0.78,0.63,0.8,0.6,"kW/ton",0.79,0.63200000000000001,443.38924926972516,49.053878122290939,{"$f":"P177/((M177-N177)/0.1)","v":31.046758305247423},null,null,0.78,0.63,0.8,0.6,"kW/ton"]
[null,"ID-Water Cooled-Rotary-2","ID","Water Cooled","Rotary",2,"≥ 75 tons and < 150 tons",0.77500000000000002,0.61499999999999999,0.79,0.58599999999999997,"kW/ton",0.79,0.63200000000000001,443.38924926972516,49.053878122290939,{"$f":"P178/((M178-N178)/0.1)","v":31.046758305247423},null,null,0.77500000000000002,0.61499999999999999,0.79,0.58599999999999997,"kW/ton"]
[null,"ID-Water Cooled-Rotary-3","ID","Water Cooled","Rotary",3,"≥ 150 tons and < 300 tons",0.68,0.57999999999999996,0.71799999999999997,0.54,"kW/ton",0.71799999999999997,0.57399999999999995,346.94119633464976,25.474144365156633,{"$f":"P179/((M179-N179)/0.1)","v":17.690378031358772},null,null,0.68,0.57999999999999996,0.71799999999999997,0.54,"kW/ton"]
[null,"ID-Water Cooled-Rotary-4","ID","Water Cooled","Rotary",4,"≥ 300 tons",0.62,0.54,0.63900000000000001,0.49,"kW/ton",0.63900000000000001,0.51100000000000001,275.83630822489715,11.398920686211682,{"$f":"P180/((M180-N180)/0.1)","v":8.9054067861028763},null,null,0.62,0.54,0.63900000000000001,0.49,"kW/ton"]
[null,"ID-Water Cooled-Screw-1","ID","Water Cooled","Screw",1,"< 75 tons",0.78,0.63,0.8,0.6,"kW/ton",0.79,0.63200000000000001,443.38924926972516,49.053878122290939,{"$f":"P181/((M181-N181)/0.1)","v":31.046758305247423},null,null,0.78,0.63,0.8,0.6,"kW/ton"]
[null,"ID-Water Cooled-Screw-2","ID","Water Cooled","Screw",2,"≥ 75 tons and < 150 tons",0.77500000000000002,0.61499999999999999,0.79,0.58599999999999997,"kW/ton",0.79,0.63200000000000001,443.38924926972516,49.053878122290939,31.046758305247423,null,null,0.77500000000000002,0.61499999999999999,0.79,0.58599999999999997,"kW/ton"]
[null,"ID-Water Cooled-Screw-3","ID","Water Cooled","Screw",3,"≥ 150 tons and < 300 tons",0.68,0.57999999999999996,0.71799999999999997,0.54,"kW/ton",0.71799999999999997,0.57399999999999995,346.94119633464976,25.474144365156633,17.690378031358772,null,null,0.68,0.57999999999999996,0.71799999999999997,0.54,"kW/ton"]
[null,"ID-Water Cooled-Screw-4","ID","Water Cooled","Screw",4,"≥ 300 tons",0.62,0.54,0.63900000000000001,0.49,"kW/ton",0.63900000000000001,0.51100000000000001,275.83630822489715,11.398920686211682,8.9054067861028763,null,null,0.62,0.54,0.63900000000000001,0.49,"kW/ton"]
[null,"ID-Water Cooled-Scroll-1","ID","Water Cooled","Scroll",1,"< 75 tons",0.78,0.63,0.8,0.6,"kW/ton",0.79,0.63200000000000001,443.38924926972516,49.053878122290939,31.046758305247423,null,null,0.78,0.63,0.8,0.6,"kW/ton"]
[null,"ID-Water Cooled-Scroll-2","ID","Water Cooled","Scroll",2,"≥ 75 tons and < 150 tons",0.77500000000000002,0.61499999999999999,0.79,0.58599999999999997,"kW/ton",0.79,0.63200000000000001,443.38924926972516,49.053878122290939,31.046758305247423,null,null,0.77500000000000002,0.61499999999999999,0.79,0.58599999999999997,"kW/ton"]
[null,"ID-Water Cooled-Scroll-3","ID","Water Cooled","Scroll",3,"≥ 150 tons and < 300 tons",0.68,0.57999999999999996,0.71799999999999997,0.54,"kW/ton",0.71799999999999997,0.57399999999999995,346.94119633464976,25.474144365156633,17.690378031358772,null,null,0.68,0.57999999999999996,0.71799999999999997,0.54,"kW/ton"]
[null,"ID-Water Cooled-Scroll-4","ID","Water Cooled","Scroll",4,"≥ 300 tons",0.62,0.54,0.63900000000000001,0.49,"kW/ton",0.63900000000000001,0.51100000000000001,275.83630822489715,11.398920686211682,8.9054067861028763,null,null,0.62,0.54,0.63900000000000001,0.49,"kW/ton"]
[null,"ID-Water Cooled-Centrifugal-1","ID","Water Cooled","Centrifugal",1,"< 75 tons",0.63400000000000001,0.59599999999999997,0.63900000000000001,0.45,"kW/ton",0.63400000000000001,0.56000000000000005,468.68792761740599,145.51913915158866,196.6474853399848,null,null,0.63400000000000001,0.59599999999999997,0.63900000000000001,0.45,"kW/ton"]
[null,{"$f":"CONCATENATE(C190,\"-\",D190,\"-\",E190,\"-\",F190)","v":"ID-Water Cooled-Centrifugal-2"},"ID","Water Cooled","Centrifugal",2,"< 150 tons",0.63400000000000001,0.59599999999999997,0.63900000000000001,0.45,"kW/ton",0.63400000000000001,0.56000000000000005,468.68792761740599,145.51913915158866,196.6474853399848,null,null,0.63400000000000001,0.59599999999999997,0.63900000000000001,0.45,"kW/ton"]
[null,{"$f":"CONCATENATE(C191,\"-\",D191,\"-\",E191,\"-\",F191)","v":"ID-Water Cooled-Centrifugal-3"},"ID","Water Cooled","Centrifugal",3,"≥ 150 tons and < 300 tons",0.63400000000000001,0.59599999999999997,0.63900000000000001,0.45,"kW/ton",0.63400000000000001,0.50700000000000001,338.7655378428837,93.841774058426779,73.891160675926599,null,null,0.63400000000000001,0.59599999999999997,0.63900000000000001,0.45,"kW/ton"]
[null,{"$f":"CONCATENATE(C192,\"-\",D192,\"-\",E192,\"-\",F192)","v":"ID-Water Cooled-Centrifugal-4"},"ID","Water Cooled","Centrifugal",4,"≥ 300 tons and < 600 tons",0.57599999999999996,0.54900000000000004,0.6,0.4,"kW/ton",0.57599999999999996,0.46100000000000002,267.71423093494184,65.580715023103664,57.026708715742352,null,null,0.57599999999999996,0.54900000000000004,0.6,0.4,"kW/ton"]
[null,{"$f":"CONCATENATE(C193,\"-\",D193,\"-\",E193,\"-\",F193)","v":"ID-Water Cooled-Centrifugal-E"},"ID","Water Cooled","Centrifugal","E","≥ 600 tons",0.56999999999999995,0.53900000000000003,0.59,0.4,"kW/ton",0.57599999999999996,0.46100000000000002,267.71423093494184,65.580715023103664,57.026708715742352,null,null,0.56999999999999995,0.53900000000000003,0.59,0.4,"kW/ton"]
[]
[null,"Equipment ID","State","Heat Rejection","Type","Size","Size ID","Minimum COP (kW/ton)","Minimum IPLV (kW/ton)",null,null,"Unit","DEER Baseline Efficiency","DEER New Efficiency (kW/ton)","DEER Baseline cost","DEER Incremental Cost ($/ton)","($/ton/(0.1 kW/ton) increase)",null,null,"Minimum Full Load (COP)","Minimum IPLV (COP)",null,null,"Unit"]
[null,null,"California Chiller Data (Title 24 - 2013)"]
[null,{"$f":"CONCATENATE(C197,\"-\",D197,\"-\",E197,\"-\",F197)","v":"CA-Air Cooled-Reciprocating-A"},"CA","Air Cooled","Reciprocating","A","< 150 tons",{"$f":"12/T197","v":1.2549675800041833},{"$f":"12/U197","v":0.96},"NA","NA","kW/ton",null,null,null,null,null,null,null,9.5619999999999994,12.5,"NA","NA","EER"]
[null,{"$f":"CONCATENATE(C198,\"-\",D198,\"-\",E198,\"-\",F198)","v":"CA-Air Cooled-Reciprocating-B"},"CA","Air Cooled","Reciprocating","B","≥ 150 tons",{"$f":"12/T198","v":1.2549675800041833},0.94117647058823528,"NA","NA","kW/ton",null,null,null,null,null,null,null,9.5619999999999994,12.75,"NA","NA","EER"]
[null,"CA-Air Cooled-Rotary-A","CA","Air Cooled","Rotary","A","< 150 tons",1.2549675800041833,0.96,"NA","NA","kW/ton",null,null,null,null,null,null,null,9.5619999999999994,12.5,"NA","NA","EER"]
[null,"CA-Air Cooled-Rotary-B","CA","Air Cooled","Rotary","B","≥ 150 tons",1.2549675800041833,0.94117647058823528,"NA","NA","kW/ton",null,null,null,null,null,null,null,9.5619999999999994,12.75,"NA","NA","EER"]
[null,"CA-Air Cooled-Screw-A","CA","Air Cooled","Screw","A","< 150 tons",1.2549675800041833,0.96,"NA","NA","kW/ton",null,null,null,null,null,null,null,9.5619999999999994,12.5,"NA","NA","EER"]
[null,"CA-Air Cooled-Screw-B","CA","Air Cooled","Screw","B","≥ 150 tons",1.2549675800041833,0.94117647058823528,"NA","NA","kW/ton",null,null,null,null,null,null,null,9.5619999999999994,12.75,"NA","NA","EER"]
[null,"CA-Air Cooled-Scroll-A","CA","Air Cooled","Scroll","A","< 150 tons",1.2549675800041833,0.96,"NA","NA","kW/ton",null,null,null,null,null,null,null,9.5619999999999994,12.5,"NA","NA","EER"]
[null,"CA-Air Cooled-Scroll-B","CA","Air Cooled","Scroll","B","≥ 150 tons",1.2549675800041833,0.94117647058823528,"NA","NA","kW/ton",null,null,null,null,null,null,null,9.5619999999999994,12.75,"NA","NA","EER"]
[null,"CA-Water Cooled-Reciprocating-A","CA","Water Cooled","Reciprocating","A","< 75 tons",0.78,0.63,0.8,0.6,"kW/ton",null,null,null,null,null,null,null,0.78,0.63,0.8,0.6,"kW/ton"]
[null,"CA-Water Cooled-Reciprocating-B","CA","Water Cooled","Reciprocating","B","≥ 75 tons and < 150 tons",0.77500000000000002,0.61499999999999999,0.79,0.58599999999999997,"kW/ton",null,null,null,null,null,null,null,0.77500000000000002,0.61499999999999999,0.79,0.58599999999999997,"kW/ton"]
[null,"CA-Water Cooled-Reciprocating-C","CA","Water Cooled","Reciprocating","C","≥ 150 tons and < 300 tons",0.68,0.57999999999999996,0.71799999999999997,0.54,"kW/ton",null,null,null,null,null,null,null,0.68,0.57999999999999996,0.71799999999999997,0.54,"kW/ton"]
[null,"CA-Water Cooled-Reciprocating-D","CA","Water Cooled","Reciprocating","D","≥ 300 tons",0.62,0.54,0.63900000000000001,0.49,"kW/ton",null,null,null,null,null,null,null,0.62,0.54,0.63900000000000001,0.49,"kW/ton"]
[null,"CA-Water Cooled-Rotary-A","CA","Water Cooled","Rotary","A","< 75 tons",0.78,0.63,0.8,0.6,"kW/ton",null,null,null,null,null,null,null,0.78,0.63,0.8,0.6,"kW/ton"]
[null,"CA-Water Cooled-Rotary-B","CA","Water Cooled","Rotary","B","≥ 75 tons and < 150 tons",0.77500000000000002,0.61499999999999999,0.79,0.58599999999999997,"kW/ton",null,null,null,null,null,null,null,0.77500000000000002,0.61499999999999999,0.79,0.58599999999999997,"kW/ton"]
[null,"CA-Water Cooled-Rotary-C","CA","Water Cooled","Rotary","C","≥ 150 tons and < 300 tons",0.68,0.57999999999999996,0.71799999999999997,0.54,"kW/ton",null,null,null,null,null,null,null,0.68,0.57999999999999996,0.71799999999999997,0.54,"kW/ton"]
[null,"CA-Water Cooled-Rotary-D","CA","Water Cooled","Rotary","D","≥ 300 tons",0.62,0.54,0.63900000000000001,0.49,"kW/ton",null,null,null,null,null,null,null,0.62,0.54,0.63900000000000001,0.49,"kW/ton"]
[null,"CA-Water Cooled-Screw-A","CA","Water Cooled","Screw","A","< 75 tons",0.78,0.63,0.8,0.6,"kW/ton",null,null,null,null,null,null,null,0.78,0.63,0.8,0.6,"kW/ton"]
[null,"CA-Water Cooled-Screw-B","CA","Water Cooled","Screw","B","≥ 75 tons and < 150 tons",0.77500000000000002,0.61499999999999999,0.79,0.58599999999999997,"kW/ton",null,null,null,null,null,null,null,0.77500000000000002,0.61499999999999999,0.79,0.58599999999999997,"kW/ton"]
[null,"CA-Water Cooled-Screw-C","CA","Water Cooled","Screw","C","≥ 150 tons and < 300 tons",0.68,0.57999999999999996,0.71799999999999997,0.54,"kW/ton",null,null,null,null,null,null,null,0.68,0.57999999999999996,0.71799999999999997,0.54,"kW/ton"]
[null,"CA-Water Cooled-Screw-D","CA","Water Cooled","Screw","D","≥ 300 tons",0.62,0.54,0.63900000000000001,0.49,"kW/ton",null,null,null,null,null,null,null,0.62,0.54,0.63900000000000001,0.49,"kW/ton"]
[null,"CA-Water Cooled-Scroll-A","CA","Water Cooled","Scroll","A","< 75 tons",0.78,0.63,0.8,0.6,"kW/ton",null,null,null,null,null,null,null,0.78,0.63,0.8,0.6,"kW/ton"]
[null,"CA-Water Cooled-Scroll-B","CA","Water Cooled","Scroll","B","≥ 75 tons and < 150 tons",0.77500000000000002,0.61499999999999999,0.79,0.58599999999999997,"kW/ton",null,null,null,null,null,null,null,0.77500000000000002,0.61499999999999999,0.79,0.58599999999999997,"kW/ton"]
[null,"CA-Water Cooled-Scroll-C","CA","Water Cooled","Scroll","C","≥ 150 tons and < 300 tons",0.68,0.57999999999999996,0.71799999999999997,0.54,"kW/ton",null,null,null,null,null,null,null,0.68,0.57999999999999996,0.71799999999999997,0.54,"kW/ton"]
[null,"CA-Water Cooled-Scroll-D","CA","Water Cooled","Scroll","D","≥ 300 tons",0.62,0.54,0.63900000000000001,0.49,"kW/ton",null,null,null,null,null,null,null,0.62,0.54,0.63900000000000001,0.49,"kW/ton"]
[null,"CA-Water Cooled-Centrifugal-A","CA","Water Cooled","Centrifugal","A","< 75 tons",0.63400000000000001,0.59599999999999997,0.63900000000000001,0.45,"kW/ton",null,null,null,null,null,null,null,0.63400000000000001,0.59599999999999997,0.63900000000000001,0.45,"kW/ton"]
[null,{"$f":"CONCATENATE(C222,\"-\",D222,\"-\",E222,\"-\",F222)","v":"CA-Water Cooled-Centrifugal-B"},"CA","Water Cooled","Centrifugal","B","< 150 tons",0.63400000000000001,0.59599999999999997,0.63900000000000001,0.45,"kW/ton",null,null,null,null,null,null,null,0.63400000000000001,0.59599999999999997,0.63900000000000001,0.45,"kW/ton"]
[null,{"$f":"CONCATENATE(C223,\"-\",D223,\"-\",E223,\"-\",F223)","v":"CA-Water Cooled-Centrifugal-C"},"CA","Water Cooled","Centrifugal","C","≥ 150 tons and < 300 tons",0.63400000000000001,0.59599999999999997,0.63900000000000001,0.45,"kW/ton",null,null,null,null,null,null,null,0.63400000000000001,0.59599999999999997,0.63900000000000001,0.45,"kW/ton"]
[null,{"$f":"CONCATENATE(C224,\"-\",D224,\"-\",E224,\"-\",F224)","v":"CA-Water Cooled-Centrifugal-D"},"CA","Water Cooled","Centrifugal","D","≥ 300 tons and < 600 tons",0.57599999999999996,0.54900000000000004,0.6,0.4,"kW/ton",null,null,null,null,null,null,null,0.57599999999999996,0.54900000000000004,0.6,0.4,"kW/ton"]
[null,{"$f":"CONCATENATE(C225,\"-\",D225,\"-\",E225,\"-\",F225)","v":"CA-Water Cooled-Centrifugal-E"},"CA","Water Cooled","Centrifugal","E","≥ 600 tons",0.56999999999999995,0.53900000000000003,0.59,0.4,"kW/ton",null,null,null,null,null,null,null,0.56999999999999995,0.53900000000000003,0.59,0.4,"kW/ton"]
[]
[null,"Equipment ID","State","Heat Rejection","Type","Size","Size ID","Minimum COP (kW/ton)","Minimum IPLV (kW/ton)",null,null,"Unit","DEER Baseline Efficiency","DEER New Efficiency (kW/ton)","DEER Baseline cost","DEER Incremental Cost ($/ton)","($/ton/(0.1 kW/ton) increase)",null,null,"Minimum Full Load (COP)","Minimum IPLV (COP)",null,null,"Unit"]
[null,null,"Wyoming Chiller Data (IECC 2009) - Effective Dec. 1, 2014"]
[null,{"$f":"CONCATENATE(C229,\"-\",D229,\"-\",E229,\"-\",F229)","v":"WY-Air Cooled-Reciprocating-A"},"WY","Air Cooled","Reciprocating","A","< 150 tons",{"$f":"12/T229","v":1.2549675800041833},{"$f":"12/U229","v":0.96},"NA","NA","kW/ton",1.26,1.008,448.95363636363641,39.935252525252508,{"$f":"P229/((M229-N229)/0.1)","v":15.847322430655757},null,null,9.5619999999999994,12.5,"NA","NA","EER"]
[null,{"$f":"CONCATENATE(C230,\"-\",D230,\"-\",E230,\"-\",F230)","v":"WY-Air Cooled-Reciprocating-B"},"WY","Air Cooled","Reciprocating","B","≥ 150 tons",{"$f":"12/T230","v":1.2549675800041833},0.94117647058823528,"NA","NA","kW/ton",1.26,1.008,448.95363636363641,39.935252525252508,15.847322430655757,null,null,9.5619999999999994,12.75,"NA","NA","EER"]
[null,"WY-Air Cooled-Rotary-A","WY","Air Cooled","Rotary","A","< 150 tons",1.2549675800041833,0.96,"NA","NA","kW/ton",1.26,1.008,448.95363636363641,39.935252525252508,15.847322430655757,null,null,9.5619999999999994,12.5,"NA","NA","EER"]
[null,"WY-Air Cooled-Rotary-B","WY","Air Cooled","Rotary","B","≥ 150 tons",1.2549675800041833,0.94117647058823528,"NA","NA","kW/ton",1.26,1.008,448.95363636363641,39.935252525252508,15.847322430655757,null,null,9.5619999999999994,12.75,"NA","NA","EER"]
[null,"WY-Air Cooled-Screw-A","WY","Air Cooled","Screw","A","< 150 tons",1.2549675800041833,0.96,"NA","NA","kW/ton",1.26,1.008,448.95363636363641,39.935252525252508,15.847322430655757,null,null,9.5619999999999994,12.5,"NA","NA","EER"]
[null,"WY-Air Cooled-Screw-B","WY","Air Cooled","Screw","B","≥ 150 tons",1.2549675800041833,0.94117647058823528,"NA","NA","kW/ton",1.26,1.008,448.95363636363641,39.935252525252508,15.847322430655757,null,null,9.5619999999999994,12.75,"NA","NA","EER"]
[null,"WY-Air Cooled-Scroll-A","WY","Air Cooled","Scroll","A","< 150 tons",1.2549675800041833,0.96,"NA","NA","kW/ton",1.26,1.008,448.95363636363641,39.935252525252508,15.847322430655757,null,null,9.5619999999999994,12.5,"NA","NA","EER"]
[null,"WY-Air Cooled-Scroll-B","WY","Air Cooled","Scroll","B","≥ 150 tons",1.2549675800041833,0.94117647058823528,"NA","NA","kW/ton",1.26,1.008,448.95363636363641,39.935252525252508,15.847322430655757,null,null,9.5619999999999994,12.75,"NA","NA","EER"]
[null,"WY-Water Cooled-Reciprocating-A","WY","Water Cooled","Reciprocating","A","< 75 tons",0.78,0.63,0.8,0.6,"kW/ton",0.83699999999999997,0.67200000000000004,462.58824239497829,16.274341238578074,9.8632371142897473,null,null,0.78,0.63,0.8,0.6,"kW/ton"]
[null,"WY-Water Cooled-Reciprocating-B","WY","Water Cooled","Reciprocating","B","≥ 75 tons and < 150 tons",0.77500000000000002,0.61499999999999999,0.79,0.58599999999999997,"kW/ton",0.83699999999999997,0.67200000000000004,462.58824239497829,16.274341238578074,9.8632371142897473,null,null,0.77500000000000002,0.61499999999999999,0.79,0.58599999999999997,"kW/ton"]
[null,"WY-Water Cooled-Reciprocating-C","WY","Water Cooled","Reciprocating","C","≥ 150 tons and < 300 tons",0.68,0.57999999999999996,0.71799999999999997,0.54,"kW/ton",0.83699999999999997,0.67200000000000004,462.58824239497829,16.274341238578074,9.8632371142897473,null,null,0.68,0.57999999999999996,0.71799999999999997,0.54,"kW/ton"]
[null,"WY-Water Cooled-Reciprocating-D","WY","Water Cooled","Reciprocating","D","≥ 300 tons",0.62,0.54,0.63900000000000001,0.49,"kW/ton",0.83699999999999997,0.67200000000000004,462.58824239497829,16.274341238578074,{"$f":"P240/((M240-N240)/0.1)","v":9.8632371142897473},null,null,0.62,0.54,0.63900000000000001,0.49,"kW/ton"]
[null,"WY-Water Cooled-Rotary-A","WY","Water Cooled","Rotary","A","< 75 tons",0.78,0.63,0.8,0.6,"kW/ton",0.79,0.63200000000000001,443.38924926972516,49.053878122290939,{"$f":"P241/((M241-N241)/0.1)","v":31.046758305247423},null,null,0.78,0.63,0.8,0.6,"kW/ton"]
[null,"WY-Water Cooled-Rotary-B","WY","Water Cooled","Rotary","B","≥ 75 tons and < 150 tons",0.77500000000000002,0.61499999999999999,0.79,0.58599999999999997,"kW/ton",0.79,0.63200000000000001,443.38924926972516,49.053878122290939,{"$f":"P242/((M242-N242)/0.1)","v":31.046758305247423},null,null,0.77500000000000002,0.61499999999999999,0.79,0.58599999999999997,"kW/ton"]
[null,"WY-Water Cooled-Rotary-C","WY","Water Cooled","Rotary","C","≥ 150 tons and < 300 tons",0.68,0.57999999999999996,0.71799999999999997,0.54,"kW/ton",0.71799999999999997,0.57399999999999995,346.94119633464976,25.474144365156633,{"$f":"P243/((M243-N243)/0.1)","v":17.690378031358772},null,null,0.68,0.57999999999999996,0.71799999999999997,0.54,"kW/ton"]
[null,"WY-Water Cooled-Rotary-D","WY","Water Cooled","Rotary","D","≥ 300 tons",0.62,0.54,0.63900000000000001,0.49,"kW/ton",0.63900000000000001,0.51100000000000001,275.83630822489715,11.398920686211682,{"$f":"P244/((M244-N244)/0.1)","v":8.9054067861028763},null,null,0.62,0.54,0.63900000000000001,0.49,"kW/ton"]
[null,"WY-Water Cooled-Screw-A","WY","Water Cooled","Screw","A","< 75 tons",0.78,0.63,0.8,0.6,"kW/ton",0.79,0.63200000000000001,443.38924926972516,49.053878122290939,{"$f":"P245/((M245-N245)/0.1)","v":31.046758305247423},null,null,0.78,0.63,0.8,0.6,"kW/ton"]
[null,"WY-Water Cooled-Screw-B","WY","Water Cooled","Screw","B","≥ 75 tons and < 150 tons",0.77500000000000002,0.61499999999999999,0.79,0.58599999999999997,"kW/ton",0.79,0.63200000000000001,443.38924926972516,49.053878122290939,31.046758305247423,null,null,0.77500000000000002,0.61499999999999999,0.79,0.58599999999999997,"kW/ton"]
[null,"WY-Water Cooled-Screw-C","WY","Water Cooled","Screw","C","≥ 150 tons and < 300 tons",0.68,0.57999999999999996,0.71799999999999997,0.54,"kW/ton",0.71799999999999997,0.57399999999999995,346.94119633464976,25.474144365156633,17.690378031358772,null,null,0.68,0.57999999999999996,0.71799999999999997,0.54,"kW/ton"]
[null,"WY-Water Cooled-Screw-D","WY","Water Cooled","Screw","D","≥ 300 tons",0.62,0.54,0.63900000000000001,0.49,"kW/ton",0.63900000000000001,0.51100000000000001,275.83630822489715,11.398920686211682,8.9054067861028763,null,null,0.62,0.54,0.63900000000000001,0.49,"kW/ton"]
[null,"WY-Water Cooled-Scroll-A","WY","Water Cooled","Scroll","A","< 75 tons",0.78,0.63,0.8,0.6,"kW/ton",0.79,0.63200000000000001,443.38924926972516,49.053878122290939,31.046758305247423,null,null,0.78,0.63,0.8,0.6,"kW/ton"]
[null,"WY-Water Cooled-Scroll-B","WY","Water Cooled","Scroll","B","≥ 75 tons and < 150 tons",0.77500000000000002,0.61499999999999999,0.79,0.58599999999999997,"kW/ton",0.79,0.63200000000000001,443.38924926972516,49.053878122290939,31.046758305247423,null,null,0.77500000000000002,0.61499999999999999,0.79,0.58599999999999997,"kW/ton"]
[null,"WY-Water Cooled-Scroll-C","WY","Water Cooled","Scroll","C","≥ 150 tons and < 300 tons",0.68,0.57999999999999996,0.71799999999999997,0.54,"kW/ton",0.71799999999999997,0.57399999999999995,346.94119633464976,25.474144365156633,17.690378031358772,null,null,0.68,0.57999999999999996,0.71799999999999997,0.54,"kW/ton"]
[null,"WY-Water Cooled-Scroll-D","WY","Water Cooled","Scroll","D","≥ 300 tons",0.62,0.54,0.63900000000000001,0.49,"kW/ton",0.63900000000000001,0.51100000000000001,275.83630822489715,11.398920686211682,8.9054067861028763,null,null,0.62,0.54,0.63900000000000001,0.49,"kW/ton"]
[null,"WY-Water Cooled-Centrifugal-A","WY","Water Cooled","Centrifugal","A","< 75 tons",0.63400000000000001,0.59599999999999997,0.63900000000000001,0.45,"kW/ton",0.63400000000000001,0.56000000000000005,468.68792761740599,145.51913915158866,196.6474853399848,null,null,0.63400000000000001,0.59599999999999997,0.63900000000000001,0.45,"kW/ton"]
[null,{"$f":"CONCATENATE(C254,\"-\",D254,\"-\",E254,\"-\",F254)","v":"WY-Water Cooled-Centrifugal-B"},"WY","Water Cooled","Centrifugal","B","< 150 tons",0.63400000000000001,0.59599999999999997,0.63900000000000001,0.45,"kW/ton",0.63400000000000001,0.56000000000000005,468.68792761740599,145.51913915158866,196.6474853399848,null,null,0.63400000000000001,0.59599999999999997,0.63900000000000001,0.45,"kW/ton"]
[null,{"$f":"CONCATENATE(C255,\"-\",D255,\"-\",E255,\"-\",F255)","v":"WY-Water Cooled-Centrifugal-C"},"WY","Water Cooled","Centrifugal","C","≥ 150 tons and < 300 tons",0.63400000000000001,0.59599999999999997,0.63900000000000001,0.45,"kW/ton",0.63400000000000001,0.50700000000000001,338.7655378428837,93.841774058426779,73.891160675926599,null,null,0.63400000000000001,0.59599999999999997,0.63900000000000001,0.45,"kW/ton"]
[null,{"$f":"CONCATENATE(C256,\"-\",D256,\"-\",E256,\"-\",F256)","v":"WY-Water Cooled-Centrifugal-D"},"WY","Water Cooled","Centrifugal","D","≥ 300 tons and < 600 tons",0.57599999999999996,0.54900000000000004,0.6,0.4,"kW/ton",0.57599999999999996,0.46100000000000002,267.71423093494184,65.580715023103664,57.026708715742352,null,null,0.57599999999999996,0.54900000000000004,0.6,0.4,"kW/ton"]
[null,{"$f":"CONCATENATE(C257,\"-\",D257,\"-\",E257,\"-\",F257)","v":"WY-Water Cooled-Centrifugal-E"},"WY","Water Cooled","Centrifugal","E","≥ 600 tons",0.56999999999999995,0.53900000000000003,0.59,0.4,"kW/ton",0.57599999999999996,0.46100000000000002,267.71423093494184,65.580715023103664,57.026708715742352,null,null,0.56999999999999995,0.53900000000000003,0.59,0.4,"kW/ton"]
[]
[null,"Equipment ID","State","Heat Rejection","Type","Size","Size ID","Minimum COP (kW/ton)","Minimum IPLV (kW/ton)",null,null,"Unit","DEER Baseline Efficiency","DEER New Efficiency (kW/ton)","DEER Baseline cost","DEER Incremental Cost ($/ton)","($/ton/(0.1 kW/ton) increase)",null,null,"Minimum Full Load (COP)","Minimum IPLV (COP)",null,null,"Unit"]
[null,null,"IDAHO Chiller Data (IECC 2012) - Effective January 1, 2015"]
[null,{"$f":"CONCATENATE(C261,\"-\",D261,\"-\",E261,\"-\",F261)","v":"ID-Air Cooled-Reciprocating-A"},"ID","Air Cooled","Reciprocating","A","< 150 tons",{"$f":"12/T261","v":1.2549675800041833},{"$f":"12/U261","v":0.96},"NA","NA","kW/ton",1.26,1.008,448.95363636363641,39.935252525252508,{"$f":"P261/((M261-N261)/0.1)","v":15.847322430655757},null,null,9.5619999999999994,12.5,"NA","NA","EER"]
[null,{"$f":"CONCATENATE(C262,\"-\",D262,\"-\",E262,\"-\",F262)","v":"ID-Air Cooled-Reciprocating-B"},"ID","Air Cooled","Reciprocating","B","≥ 150 tons",{"$f":"12/T262","v":1.2549675800041833},0.94117647058823528,"NA","NA","kW/ton",1.26,1.008,448.95363636363641,39.935252525252508,15.847322430655757,null,null,9.5619999999999994,12.75,"NA","NA","EER"]
[null,"ID-Air Cooled-Rotary-A","ID","Air Cooled","Rotary","A","< 150 tons",1.2549675800041833,0.96,"NA","NA","kW/ton",1.26,1.008,448.95363636363641,39.935252525252508,15.847322430655757,null,null,9.5619999999999994,12.5,"NA","NA","EER"]
[null,"ID-Air Cooled-Rotary-B","ID","Air Cooled","Rotary","B","≥ 150 tons",1.2549675800041833,0.94117647058823528,"NA","NA","kW/ton",1.26,1.008,448.95363636363641,39.935252525252508,15.847322430655757,null,null,9.5619999999999994,12.75,"NA","NA","EER"]
[null,"ID-Air Cooled-Screw-A","ID","Air Cooled","Screw","A","< 150 tons",1.2549675800041833,0.96,"NA","NA","kW/ton",1.26,1.008,448.95363636363641,39.935252525252508,15.847322430655757,null,null,9.5619999999999994,12.5,"NA","NA","EER"]
[null,"ID-Air Cooled-Screw-B","ID","Air Cooled","Screw","B","≥ 150 tons",1.2549675800041833,0.94117647058823528,"NA","NA","kW/ton",1.26,1.008,448.95363636363641,39.935252525252508,15.847322430655757,null,null,9.5619999999999994,12.75,"NA","NA","EER"]
[null,"ID-Air Cooled-Scroll-A","ID","Air Cooled","Scroll","A","< 150 tons",1.2549675800041833,0.96,"NA","NA","kW/ton",1.26,1.008,448.95363636363641,39.935252525252508,15.847322430655757,null,null,9.5619999999999994,12.5,"NA","NA","EER"]
[null,"ID-Air Cooled-Scroll-B","ID","Air Cooled","Scroll","B","≥ 150 tons",1.2549675800041833,0.94117647058823528,"NA","NA","kW/ton",1.26,1.008,448.95363636363641,39.935252525252508,15.847322430655757,null,null,9.5619999999999994,12.75,"NA","NA","EER"]
[null,"ID-Water Cooled-Reciprocating-A","ID","Water Cooled","Reciprocating","A","< 75 tons",0.78,0.63,0.8,0.6,"kW/ton",0.83699999999999997,0.67200000000000004,462.58824239497829,16.274341238578074,9.8632371142897473,null,null,0.78,0.63,0.8,0.6,"kW/ton"]
[null,"ID-Water Cooled-Reciprocating-B","ID","Water Cooled","Reciprocating","B","≥ 75 tons and < 150 tons",0.77500000000000002,0.61499999999999999,0.79,0.58599999999999997,"kW/ton",0.83699999999999997,0.67200000000000004,462.58824239497829,16.274341238578074,9.8632371142897473,null,null,0.77500000000000002,0.61499999999999999,0.79,0.58599999999999997,"kW/ton"]
[null,"ID-Water Cooled-Reciprocating-C","ID","Water Cooled","Reciprocating","C","≥ 150 tons and < 300 tons",0.68,0.57999999999999996,0.71799999999999997,0.54,"kW/ton",0.83699999999999997,0.67200000000000004,462.58824239497829,16.274341238578074,9.8632371142897473,null,null,0.68,0.57999999999999996,0.71799999999999997,0.54,"kW/ton"]
[null,"ID-Water Cooled-Reciprocating-D","ID","Water Cooled","Reciprocating","D","≥ 300 tons",0.62,0.54,0.63900000000000001,0.49,"kW/ton",0.83699999999999997,0.67200000000000004,462.58824239497829,16.274341238578074,{"$f":"P272/((M272-N272)/0.1)","v":9.8632371142897473},null,null,0.62,0.54,0.63900000000000001,0.49,"kW/ton"]
[null,"ID-Water Cooled-Rotary-A","ID","Water Cooled","Rotary","A","< 75 tons",0.78,0.63,0.8,0.6,"kW/ton",0.79,0.63200000000000001,443.38924926972516,49.053878122290939,{"$f":"P273/((M273-N273)/0.1)","v":31.046758305247423},null,null,0.78,0.63,0.8,0.6,"kW/ton"]
[null,"ID-Water Cooled-Rotary-B","ID","Water Cooled","Rotary","B","≥ 75 tons and < 150 tons",0.77500000000000002,0.61499999999999999,0.79,0.58599999999999997,"kW/ton",0.79,0.63200000000000001,443.38924926972516,49.053878122290939,{"$f":"P274/((M274-N274)/0.1)","v":31.046758305247423},null,null,0.77500000000000002,0.61499999999999999,0.79,0.58599999999999997,"kW/ton"]
[null,"ID-Water Cooled-Rotary-C","ID","Water Cooled","Rotary","C","≥ 150 tons and < 300 tons",0.68,0.57999999999999996,0.71799999999999997,0.54,"kW/ton",0.71799999999999997,0.57399999999999995,346.94119633464976,25.474144365156633,{"$f":"P275/((M275-N275)/0.1)","v":17.690378031358772},null,null,0.68,0.57999999999999996,0.71799999999999997,0.54,"kW/ton"]
[null,"ID-Water Cooled-Rotary-D","ID","Water Cooled","Rotary","D","≥ 300 tons",0.62,0.54,0.63900000000000001,0.49,"kW/ton",0.63900000000000001,0.51100000000000001,275.83630822489715,11.398920686211682,{"$f":"P276/((M276-N276)/0.1)","v":8.9054067861028763},null,null,0.62,0.54,0.63900000000000001,0.49,"kW/ton"]
[null,"ID-Water Cooled-Screw-A","ID","Water Cooled","Screw","A","< 75 tons",0.78,0.63,0.8,0.6,"kW/ton",0.79,0.63200000000000001,443.38924926972516,49.053878122290939,{"$f":"P277/((M277-N277)/0.1)","v":31.046758305247423},null,null,0.78,0.63,0.8,0.6,"kW/ton"]
[null,"ID-Water Cooled-Screw-B","ID","Water Cooled","Screw","B","≥ 75 tons and < 150 tons",0.77500000000000002,0.61499999999999999,0.79,0.58599999999999997,"kW/ton",0.79,0.63200000000000001,443.38924926972516,49.053878122290939,31.046758305247423,null,null,0.77500000000000002,0.61499999999999999,0.79,0.58599999999999997,"kW/ton"]
[null,"ID-Water Cooled-Screw-C","ID","Water Cooled","Screw","C","≥ 150 tons and < 300 tons",0.68,0.57999999999999996,0.71799999999999997,0.54,"kW/ton",0.71799999999999997,0.57399999999999995,346.94119633464976,25.474144365156633,17.690378031358772,null,null,0.68,0.57999999999999996,0.71799999999999997,0.54,"kW/ton"]
[null,"ID-Water Cooled-Screw-D","ID","Water Cooled","Screw","D","≥ 300 tons",0.62,0.54,0.63900000000000001,0.49,"kW/ton",0.63900000000000001,0.51100000000000001,275.83630822489715,11.398920686211682,8.9054067861028763,null,null,0.62,0.54,0.63900000000000001,0.49,"kW/ton"]
[null,"ID-Water Cooled-Scroll-A","ID","Water Cooled","Scroll","A","< 75 tons",0.78,0.63,0.8,0.6,"kW/ton",0.79,0.63200000000000001,443.38924926972516,49.053878122290939,31.046758305247423,null,null,0.78,0.63,0.8,0.6,"kW/ton"]
[null,"ID-Water Cooled-Scroll-B","ID","Water Cooled","Scroll","B","≥ 75 tons and < 150 tons",0.77500000000000002,0.61499999999999999,0.79,0.58599999999999997,"kW/ton",0.79,0.63200000000000001,443.38924926972516,49.053878122290939,31.046758305247423,null,null,0.77500000000000002,0.61499999999999999,0.79,0.58599999999999997,"kW/ton"]
[null,"ID-Water Cooled-Scroll-C","ID","Water Cooled","Scroll","C","≥ 150 tons and < 300 tons",0.68,0.57999999999999996,0.71799999999999997,0.54,"kW/ton",0.71799999999999997,0.57399999999999995,346.94119633464976,25.474144365156633,17.690378031358772,null,null,0.68,0.57999999999999996,0.71799999999999997,0.54,"kW/ton"]
[null,"ID-Water Cooled-Scroll-D","ID","Water Cooled","Scroll","D","≥ 300 tons",0.62,0.54,0.63900000000000001,0.49,"kW/ton",0.63900000000000001,0.51100000000000001,275.83630822489715,11.398920686211682,8.9054067861028763,null,null,0.62,0.54,0.63900000000000001,0.49,"kW/ton"]
[null,"ID-Water Cooled-Centrifugal-A","ID","Water Cooled","Centrifugal","A","< 75 tons",0.63400000000000001,0.59599999999999997,0.63900000000000001,0.45,"kW/ton",0.63400000000000001,0.56000000000000005,468.68792761740599,145.51913915158866,196.6474853399848,null,null,0.63400000000000001,0.59599999999999997,0.63900000000000001,0.45,"kW/ton"]
[null,{"$f":"CONCATENATE(C286,\"-\",D286,\"-\",E286,\"-\",F286)","v":"ID-Water Cooled-Centrifugal-B"},"ID","Water Cooled","Centrifugal","B","< 150 tons",0.63400000000000001,0.59599999999999997,0.63900000000000001,0.45,"kW/ton",0.63400000000000001,0.56000000000000005,468.68792761740599,145.51913915158866,196.6474853399848,null,null,0.63400000000000001,0.59599999999999997,0.63900000000000001,0.45,"kW/ton"]
[null,{"$f":"CONCATENATE(C287,\"-\",D287,\"-\",E287,\"-\",F287)","v":"ID-Water Cooled-Centrifugal-C"},"ID","Water Cooled","Centrifugal","C","≥ 150 tons and < 300 tons",0.63400000000000001,0.59599999999999997,0.63900000000000001,0.45,"kW/ton",0.63400000000000001,0.50700000000000001,338.7655378428837,93.841774058426779,73.891160675926599,null,null,0.63400000000000001,0.59599999999999997,0.63900000000000001,0.45,"kW/ton"]
[null,"ID-Water Cooled-Centrifugal-D","ID","Water Cooled","Centrifugal","D","≥ 300 tons and < 600 tons",0.57599999999999996,0.54900000000000004,0.6,0.4,"kW/ton",0.57599999999999996,0.46100000000000002,267.71423093494184,65.580715023103664,57.026708715742352,null,null,0.57599999999999996,0.54900000000000004,0.6,0.4,"kW/ton"]
[null,"ID-Water Cooled-Centrifugal-E","ID","Water Cooled","Centrifugal","E","≥ 600 tons",0.56999999999999995,0.53900000000000003,0.59,0.4,"kW/ton",0.57599999999999996,0.46100000000000002,267.71423093494184,65.580715023103664,57.026708715742352,null,null,0.56999999999999995,0.53900000000000003,0.59,0.4,"kW/ton"]
[]
[null,"Equipment ID","State","Heat Rejection","Type","Size","Size ID","Minimum COP (kW/ton)","Minimum IPLV (kW/ton)",null,null,"Unit","DEER Baseline Efficiency","DEER New Efficiency (kW/ton)","DEER Baseline cost","DEER Incremental Cost ($/ton)","($/ton/(0.1 kW/ton) increase)",null,null,"Minimum Full Load (COP)","Minimum IPLV (COP)",null,null,"Unit"]
[null,null,"Washington Chiller Data (WSEC 2015) - Effective July 1, 2016"]
[null,{"$f":"CONCATENATE(C293,\"-\",D293,\"-\",E293,\"-\",F293)","v":"WA-Air Cooled-Reciprocating-A"},"WA","Air Cooled","Reciprocating","A","< 150 tons",1.1881188118811881,0.87591240875912413,1.2371134020618557,0.75949367088607589,"kW/ton",1.26,1.008,448.95363636363641,39.935252525252508,{"$f":"P293/((M293-N293)/0.1)","v":15.847322430655757},null,null,9.5619999999999994,12.5,"NA","NA","EER"]
[null,{"$f":"CONCATENATE(C294,\"-\",D294,\"-\",E294,\"-\",F294)","v":"WA-Air Cooled-Reciprocating-B"},"WA","Air Cooled","Reciprocating","B","≥ 150 tons",1.1881188118811881,0.8571428571428571,1.2371134020618557,0.74534161490683226,"kW/ton",1.26,1.008,448.95363636363641,39.935252525252508,15.847322430655757,null,null,9.5619999999999994,12.75,"NA","NA","EER"]
[null,"WA-Air Cooled-Rotary-A","WA","Air Cooled","Rotary","A","< 150 tons",1.1881188118811881,0.87591240875912413,1.2371134020618557,0.75949367088607589,"kW/ton",1.26,1.008,448.95363636363641,39.935252525252508,15.847322430655757,null,null,9.5619999999999994,12.5,"NA","NA","EER"]
[null,"WA-Air Cooled-Rotary-B","WA","Air Cooled","Rotary","B","≥ 150 tons",1.1881188118811881,0.8571428571428571,1.2371134020618557,0.74534161490683226,"kW/ton",1.26,1.008,448.95363636363641,39.935252525252508,15.847322430655757,null,null,9.5619999999999994,12.75,"NA","NA","EER"]
[null,"WA-Air Cooled-Screw-A","WA","Air Cooled","Screw","A","< 150 tons",1.1881188118811881,0.87591240875912413,1.2371134020618557,0.75949367088607589,"kW/ton",1.26,1.008,448.95363636363641,39.935252525252508,15.847322430655757,null,null,9.5619999999999994,12.5,"NA","NA","EER"]
[null,"WA-Air Cooled-Screw-B","WA","Air Cooled","Screw","B","≥ 150 tons",1.1881188118811881,0.8571428571428571,1.2371134020618557,0.74534161490683226,"kW/ton",1.26,1.008,448.95363636363641,39.935252525252508,15.847322430655757,null,null,9.5619999999999994,12.75,"NA","NA","EER"]
[null,"WA-Air Cooled-Scroll-A","WA","Air Cooled","Scroll","A","< 150 tons",1.1881188118811881,0.87591240875912413,1.2371134020618557,0.75949367088607589,"kW/ton",1.26,1.008,448.95363636363641,39.935252525252508,15.847322430655757,null,null,9.5619999999999994,12.5,"NA","NA","EER"]
[null,"WA-Air Cooled-Scroll-B","WA","Air Cooled","Scroll","B","≥ 150 tons",1.1881188118811881,0.8571428571428571,1.2371134020618557,0.74534161490683226,"kW/ton",1.26,1.008,448.95363636363641,39.935252525252508,15.847322430655757,null,null,9.5619999999999994,12.75,"NA","NA","EER"]
[null,"WA-Water Cooled-Reciprocating-A","WA","Water Cooled","Reciprocating","A","< 75 tons",0.75,0.6,0.78,0.5,"kW/ton",0.83699999999999997,0.67200000000000004,462.58824239497829,16.274341238578074,9.8632371142897473,null,null,0.78,0.63,0.8,0.6,"kW/ton"]
[null,"WA-Water Cooled-Reciprocating-B","WA","Water Cooled","Reciprocating","B","≥ 75 tons and < 150 tons",0.72,0.56000000000000005,0.75,0.49,"kW/ton",0.83699999999999997,0.67200000000000004,462.58824239497829,16.274341238578074,9.8632371142897473,null,null,0.77500000000000002,0.61499999999999999,0.79,0.58599999999999997,"kW/ton"]
[null,"WA-Water Cooled-Reciprocating-C","WA","Water Cooled","Reciprocating","C","≥ 150 tons and < 300 tons",0.66,0.54,0.68,0.44,"kW/ton",0.83699999999999997,0.67200000000000004,462.58824239497829,16.274341238578074,9.8632371142897473,null,null,0.68,0.57999999999999996,0.71799999999999997,0.54,"kW/ton"]
[null,"WA-Water Cooled-Reciprocating-D","WA","Water Cooled","Reciprocating","D","≥ 300 tons and < 600 tons",0.61,0.52,0.625,0.41,"kW/ton",0.83699999999999997,0.67200000000000004,462.58824239497829,16.274341238578074,{"$f":"P304/((M304-N304)/0.1)","v":9.8632371142897473},null,null,0.62,0.54,0.63900000000000001,0.49,"kW/ton"]
[null,"WA-Water Cooled-Reciprocating-E","WA","Water Cooled","Reciprocating","E","≥ 600 tons",0.56000000000000005,0.5,0.58499999999999996,0.38,"kW/ton"]
[null,"WA-Water Cooled-Rotary-A","WA","Water Cooled","Rotary","A","< 75 tons",0.75,0.6,0.78,0.5,"kW/ton",0.79,0.63200000000000001,443.38924926972516,49.053878122290939,{"$f":"P306/((M306-N306)/0.1)","v":31.046758305247423},null,null,0.78,0.63,0.8,0.6,"kW/ton"]
[null,"WA-Water Cooled-Rotary-B","WA","Water Cooled","Rotary","B","≥ 75 tons and < 150 tons",0.72,0.56000000000000005,0.75,0.49,"kW/ton",0.79,0.63200000000000001,443.38924926972516,49.053878122290939,{"$f":"P307/((M307-N307)/0.1)","v":31.046758305247423},null,null,0.77500000000000002,0.61499999999999999,0.79,0.58599999999999997,"kW/ton"]
[null,"WA-Water Cooled-Rotary-C","WA","Water Cooled","Rotary","C","≥ 150 tons and < 300 tons",0.66,0.54,0.68,0.44,"kW/ton",0.71799999999999997,0.57399999999999995,346.94119633464976,25.474144365156633,{"$f":"P308/((M308-N308)/0.1)","v":17.690378031358772},null,null,0.68,0.57999999999999996,0.71799999999999997,0.54,"kW/ton"]
[null,"WA-Water Cooled-Rotary-D","WA","Water Cooled","Rotary","D","≥ 300 tons and < 600 tons",0.61,0.52,0.625,0.41,"kW/ton",0.63900000000000001,0.51100000000000001,275.83630822489715,11.398920686211682,{"$f":"P309/((M309-N309)/0.1)","v":8.9054067861028763},null,null,0.62,0.54,0.63900000000000001,0.49,"kW/ton"]
[null,"WA-Water Cooled-Rotary-E","WA","Water Cooled","Rotary","E","≥ 600 tons",0.56000000000000005,0.5,0.58499999999999996,0.38,"kW/ton"]
[null,"WA-Water Cooled-Screw-A","WA","Water Cooled","Screw","A","< 75 tons",0.75,0.6,0.78,0.5,"kW/ton",0.79,0.63200000000000001,443.38924926972516,49.053878122290939,{"$f":"P311/((M311-N311)/0.1)","v":31.046758305247423},null,null,0.78,0.63,0.8,0.6,"kW/ton"]
[null,"WA-Water Cooled-Screw-B","WA","Water Cooled","Screw","B","≥ 75 tons and < 150 tons",0.72,0.56000000000000005,0.75,0.49,"kW/ton",0.79,0.63200000000000001,443.38924926972516,49.053878122290939,31.046758305247423,null,null,0.77500000000000002,0.61499999999999999,0.79,0.58599999999999997,"kW/ton"]
[null,"WA-Water Cooled-Screw-C","WA","Water Cooled","Screw","C","≥ 150 tons and < 300 tons",0.66,0.54,0.68,0.44,"kW/ton",0.71799999999999997,0.57399999999999995,346.94119633464976,25.474144365156633,17.690378031358772,null,null,0.68,0.57999999999999996,0.71799999999999997,0.54,"kW/ton"]
[null,"WA-Water Cooled-Screw-D","WA","Water Cooled","Screw","D","≥ 300 tons and < 600 tons",0.61,0.52,0.625,0.41,"kW/ton",0.63900000000000001,0.51100000000000001,275.83630822489715,11.398920686211682,8.9054067861028763,null,null,0.62,0.54,0.63900000000000001,0.49,"kW/ton"]
[null,"WA-Water Cooled-Screw-E","WA","Water Cooled","Screw","E","≥ 600 tons",0.56000000000000005,0.5,0.58499999999999996,0.38,"kW/ton"]
[null,"WA-Water Cooled-Scroll-A","WA","Water Cooled","Scroll","A","< 75 tons",0.75,0.6,0.78,0.5,"kW/ton",0.79,0.63200000000000001,443.38924926972516,49.053878122290939,{"$f":"P316/((M316-N316)/0.1)","v":31.046758305247423},null,null,0.78,0.63,0.8,0.6,"kW/ton"]
[null,"WA-Water Cooled-Scroll-B","WA","Water Cooled","Scroll","B","≥ 75 tons and < 150 tons",0.72,0.56000000000000005,0.75,0.49,"kW/ton",0.79,0.63200000000000001,443.38924926972516,49.053878122290939,31.046758305247423,null,null,0.77500000000000002,0.61499999999999999,0.79,0.58599999999999997,"kW/ton"]
[null,"WA-Water Cooled-Scroll-C","WA","Water Cooled","Scroll","C","≥ 150 tons and < 300 tons",0.66,0.54,0.68,0.44,"kW/ton",0.71799999999999997,0.57399999999999995,346.94119633464976,25.474144365156633,17.690378031358772,null,null,0.68,0.57999999999999996,0.71799999999999997,0.54,"kW/ton"]
[null,"WA-Water Cooled-Scroll-D","WA","Water Cooled","Scroll","D","≥ 300 tons and < 600 tons",0.61,0.52,0.625,0.41,"kW/ton",0.63900000000000001,0.51100000000000001,275.83630822489715,11.398920686211682,8.9054067861028763,null,null,0.62,0.54,0.63900000000000001,0.49,"kW/ton"]
[null,"WA-Water Cooled-Scroll-E","WA","Water Cooled","Scroll","E","≥ 600 tons",0.56000000000000005,0.5,0.58499999999999996,0.38,"kW/ton"]
[null,"WA-Water Cooled-Centrifugal-A","WA","Water Cooled","Centrifugal","A","< 75 tons",0.63400000000000001,0.59599999999999997,0.63900000000000001,0.45,"kW/ton",0.63400000000000001,0.56000000000000005,468.68792761740599,145.51913915158866,{"$f":"P321/((M321-N321)/0.1)","v":196.6474853399848},null,null,0.63400000000000001,0.59599999999999997,0.63900000000000001,0.45,"kW/ton"]
[null,{"$f":"CONCATENATE(C322,\"-\",D322,\"-\",E322,\"-\",F322)","v":"WA-Water Cooled-Centrifugal-B"},"WA","Water Cooled","Centrifugal","B","< 150 tons",0.61,0.55000000000000004,0.69499999999999995,0.44,"kW/ton",0.63400000000000001,0.56000000000000005,468.68792761740599,145.51913915158866,196.6474853399848,null,null,0.63400000000000001,0.59599999999999997,0.63900000000000001,0.45,"kW/ton"]
[null,{"$f":"CONCATENATE(C323,\"-\",D323,\"-\",E323,\"-\",F323)","v":"WA-Water Cooled-Centrifugal-C"},"WA","Water Cooled","Centrifugal","C","≥ 150 tons and < 300 tons",0.61,0.55000000000000004,0.63500000000000001,0.4,"kW/ton",0.63400000000000001,0.50700000000000001,338.7655378428837,93.841774058426779,73.891160675926599,null,null,0.63400000000000001,0.59599999999999997,0.63900000000000001,0.45,"kW/ton"]
[null,"WA-Water Cooled-Centrifugal-D","WA","Water Cooled","Centrifugal","D","≥ 300 tons and < 400 tons",0.56000000000000005,0.52,0.59499999999999997,0.39,"kW/ton",0.57599999999999996,0.46100000000000002,267.71423093494184,65.580715023103664,57.026708715742352,null,null,0.57599999999999996,0.54900000000000004,0.6,0.4,"kW/ton"]
[null,"WA-Water Cooled-Centrifugal-E","WA","Water Cooled","Centrifugal","E","≥ 400 tons",0.56000000000000005,0.5,0.58499999999999996,0.38,"kW/ton",0.57599999999999996,0.46100000000000002,267.71423093494184,65.580715023103664,57.026708715742352,null,null,0.56999999999999995,0.53900000000000003,0.59,0.4,"kW/ton"]

{"sheet":"EFLH Lookup","index":9,"n_rows":10,"n_cols":7,"rows_kept":10,"cut":false,"hidden":true,"merged":[]}
[]
[null,"Building Type","A","b","CDD","Default if  < 75","EFLH"]
[null,"Education - Community College",327.83,-0.88349999999999995,{"$f":"'Chiller Calculator'!C31","v":""},300,{"$f":"IF(E3>=75,C3*(E3^D3)*E3,F3)","v":{"$error":"#VALUE!"}}]
[null,"Education - Secondary School",240.98,-0.91739999999999999,{"$f":"E3","v":""},183,{"$f":"IF(E4>=75,C4*(E4^D4)*E4,F4)","v":{"$error":"#VALUE!"}}]
[null,"Education - University",512.11,-0.91479999999999995,{"$f":"E4","v":""},464,{"$f":"IF(E5>=75,C5*(E5^D5)*E5,F5)","v":{"$error":"#VALUE!"}}]
[null,"Health/Medical - Clinic",313.54000000000002,-0.84370000000000001,"",480,{"$error":"#VALUE!"}]
[null,"Health/Medical - Hospital",730.76,-0.88360000000000005,"",857,{"$error":"#VALUE!"}]
[null,"Lodging",589.61,-0.875,"",782,{"$error":"#VALUE!"}]
[null,"Office",657.91,-0.94369999999999998,"",493,{"$error":"#VALUE!"}]
[null,"Retail",404,-0.86450000000000005,"",493,{"$error":"#VALUE!"}]

{"sheet":"Rates","index":10,"n_rows":46,"n_cols":9,"rows_kept":46,"cut":false,"hidden":true,"merged":[[14,7,14,8],[7,0,7,2],[0,0,6,2],[0,3,3,5],[9,6,45,6],[0,6,8,6],[4,3,5,5],[6,3,8,3],[6,4,6,5],[15,7,15,8]]}
["Rate Lookups",null,null,"Simplified Rate Table For FinAnswer Express"]
[]
[]
[]
[null,null,null,"\nAverage Secondary except where noted\n"]
[]
[null,null,null,"State","Cost"]
["Selected",null,null,null,{"$f":"IF(OR($B$9=0,$C$9=0),\"Enter State and Rate Schedule Into Yellow Cells Above\",VLOOKUP($B$9&\" \"&$C$9,$D$10:$F$46,2,0))","v":"Enter State and Rate Schedule Into Yellow Cells Above"},{"$f":"IF(OR($B$9=0,$C$9=0),\"Enter State and Rate Schedule Into Yellow Cells Above\",VLOOKUP($B$9&\" \"&$C$9,$D$10:$F$46,3,0))","v":"Enter State and Rate Schedule Into Yellow Cells Above"},null,"Updated 4/1/2025"]
[null,{"$f":"'Chiller Calculator'!$C$7","v":0},{"$f":"'Chiller Calculator'!C8","v":0},null,"kWh","Demand",null,"Rates Effective as of:"]
[1,{"$f":"IF(ISERROR(MID(VLOOKUP(LARGE($C$10:$C$46,A10),$C$10:$D$46,2,),4,5)),\"\",MID(VLOOKUP(LARGE($C$10:$C$46,A10),$C$10:$D$46,2,),4,5))","v":""},{"$f":"IF(LEFT(D10,2)=$B$9,A10,\"\")","v":""},"WY 212",null,null,"Update Rates Here","CA","2015-08-26"]
[2,"",{"$f":"IF(LEFT(D11,2)=$B$9,A11,\"\")","v":""},"WY 210",null,null,null,"ID","2025-02-06"]
[3,"","","WY 58",6.5320000000000003E-2,0,null,"UT","2025-02-06"]
[4,"","","WY 54",6.4939999999999998E-2,0,null,"WA","2018-11-01"]
[5,"","","WY 48T",0,0,null,"WY","2025-02-06"]
[6,"","","WY 46",4.9189999999999998E-2,21.109000000000002,null,"Rates for Software 11.19.2018.2"]
[7,"","","WY 40",6.6409999999999997E-2,9.8379999999999992,null,"ID/WY/UT updated per Rates of Software 2-6-2025"]
[8,"","","WY 33",0.48280000000000001,21.472999999999999]
[9,"","","WY 28",4.7800000000000002E-2,21.651]
[10,"","","WY 25",0.1051,0]
[11,"","","WA 48T",4.709E-2,9.25]
[12,"","","WA 40",7.4569999999999997E-2,2.2189999999999999]
[13,"",{"$f":"IF(LEFT(D22,2)=$B$9,A22,\"\")","v":""},"WA 36",5.2830000000000002E-2,7.1]
[14,"","","WA 24",6.3570000000000002E-2,0]
[15,"","","UT 23",7.7890000000000001E-2,10.563000000000001]
[16,"","","UT 10",6.8190000000000001E-2,9.2609999999999992]
[17,"","","UT 9",6.8959999999999994E-2,21.475000000000001]
[18,"","","UT 9A",7.0739999999999997E-2]
[19,"","","UT 8",7.3859999999999995E-2,23.613]
[20,"","","UT 6",4.802E-2,16.388000000000002]
[21,"","","ID 35",7.8619999999999995E-2,20.459]
[22,"","","ID 23",0.11264,0]
[23,"","","ID 10",7.3429999999999995E-2,7.226]
[24,"","","ID 9",7.2590000000000002E-2,11.7]
[25,"","","ID 6",6.4140000000000003E-2,15.585000000000001]
[26,"","","ID 6A",6.3969999999999999E-2,15.585000000000001]
[27,"","","CA 48",9.819E-2,7.15]
[28,"","","CA 36",0.11493,8.51]
[29,"","","CA 32",0.14724000000000001,3.8]
[30,"","","CA 25",0.16464999999999999]
[31,"","","CA PA20",0.13489999999999999,3.9460000000000002]
[32,"","","","",""]
[33,"","","","",""]
[34,"","","","",""]
[35,"","","","",""]
[36,"","","","",""]
[37,"","","","",""]

{"sheet":"CA Title 24-2008","index":11,"n_rows":0,"n_cols":0,"rows_kept":0,"cut":false,"hidden":true,"merged":[]}

{"sheet":"IECC 2003","index":12,"n_rows":0,"n_cols":0,"rows_kept":0,"cut":false,"hidden":true,"merged":[]}

{"sheet":"IECC 2006","index":13,"n_rows":0,"n_cols":0,"rows_kept":0,"cut":false,"hidden":true,"merged":[]}

{"sheet":"IECC 2009","index":14,"n_rows":0,"n_cols":0,"rows_kept":0,"cut":false,"hidden":true,"merged":[]}

{"sheet":"WSEC 2009","index":15,"n_rows":0,"n_cols":0,"rows_kept":0,"cut":false,"hidden":true,"merged":[]}

{"sheet":"WSEC 2006","index":16,"n_rows":0,"n_cols":0,"rows_kept":0,"cut":false,"hidden":true,"merged":[]}

{"sheet":"IECC & WSEC 2012","index":17,"n_rows":0,"n_cols":0,"rows_kept":0,"cut":false,"hidden":true,"merged":[]}

{"sheet":"IECC 2015","index":18,"n_rows":0,"n_cols":0,"rows_kept":0,"cut":false,"hidden":true,"merged":[]}

{"sheet":"IECC 2018","index":19,"n_rows":0,"n_cols":0,"rows_kept":0,"cut":false,"hidden":true,"merged":[]}

{"sheet":"IECC 2021","index":20,"n_rows":0,"n_cols":0,"rows_kept":0,"cut":false,"hidden":true,"merged":[]}

{"sheet":"WSEC 2018","index":21,"n_rows":0,"n_cols":0,"rows_kept":0,"cut":false,"hidden":true,"merged":[]}

{"sheet":"WSEC 2021","index":22,"n_rows":0,"n_cols":0,"rows_kept":0,"cut":false,"hidden":true,"merged":[]}

{"sheet":"CA Title 24-2013","index":23,"n_rows":0,"n_cols":0,"rows_kept":0,"cut":false,"hidden":true,"merged":[]}

{"sheet":"Change Log","index":24,"n_rows":22,"n_cols":6,"rows_kept":22,"cut":false,"hidden":true,"merged":[]}
["Date","Change Description","Name","Previous Revision #","New Revision #","Current Revision\n(click to check)"]
["2012-08-16","updated RMP rates (ID, UT, WY)","Troy Williams","071412","071412.2"]
["2013-05-16","Revisions/updates to user interface including: Layout, addition of application print out option, additional help buttons, links to AHRI standards and weather station information.\n\nIncreased functionality to allow cross tarrif (not applied retro actively/ Currently UT only) and cross state energy code changes for current and previous codes.\n\nUpdates for new UT tariff incentive rate ($0.15/kWh for new tariff, $0.12/kWh + $50.00/kW for the previous tariff)\n\nUpdates to rate schedules","Troy Williams, Jake Demann","071412.2","070113.1"]
["2013-07-02","Updates to rate schedules","Jake DeMann",70113.100000000006,70113.2]
["2013-12-27","Updated for new WA tariff incentive rate ($0.15/kWh for new tariff, $0.12/kWh + $50.00/kW for the previous tariff)\nIncluded WA in cross tariff functionality, (CA,ID,WY remain single tariff only)\nWA now exports to wattsmart Business application. Note: General application has not yet been updated","Jake DeMann",70113.100000000006,"010114.1"]
["2014-01-07","Updated rates, using Rates for Software 1-1-2014","Jake DeMann","010114.1","010114.2"]
["2014-06-15","UT Code and Tariff Labels Update\n\nCA code efficiency revisions.\n      Functionality across codes (Title 24-2008 & Title 24-2013)\n\nNo changes to incentive rates.","Jake DeMann","010114.2","010714.1"]
["2014-07-10","Updates to print-out to reduce user preferences from creating excessive pages","Jake DeMann","010714.1","010714.2"]
["2014-10-27","Idaho changes:\n- Updated tariff number and effective date\n- Program name updated to wattsmart Business\n- Application printout updated to general application/wattsmart business format\n- Incentive rate revised to $0.15/kWh for projects completed after November 1, 2014\n","Jake DeMann","'010714.2","110114.1"]
["2014-11-18","Added referenced tables for code baseline, updated version and ID tariff effective date","Jake DeMann","110114.1","111314.1"]
["2014-11-24","- WY tariff schedule revised to 140\n- WY tariff effective date revised to December 1, 2014\n- WY messaging/application revised to wattsmart Business\n- WY incentive rate revised to $0.15/kWh + $50/kW for projects completed on or after December 1, 2014 (Previous projects paid at $0.12/kWh + $50/kW)\n- Added IECC 2009 baseline for WY projects completed on or after December 1, 2014 (Previous projects use IECC 2003 baseline)\n- Version # revised, beta version for testing, release version to be 120114.1\n","Jake DeMann","111314.1","beta 120114"]
["2014-12-05","Added IECC 2012 baseline to Chiller Data table for ID projects completed on or after January 1, 2015 (Previous projects use IECC 2009 baseline)\nRemoved IECC 2006 baseline from Chiller Data table\nBaseline messaging revised to reflect code changes\n","Jake DeMann","beta 120114","beta 010115"]
["2014-12-09","QC report revisions:\n- Cell I51 of the “Chiller Calculator” tab, date validation has been added to the formula to correctly apply the incentive rate.\n- Application page formating adjusted to prevent print-out errors.\n- Updated rate schedules to match Rates for Software 1-1-2015 (updated on 1/5/2015)","Jake DeMann","beta 010115"," 010115.1"]
["2015-04-15","- CA tariff schedule revised to 140\n- CA tariff effective date revised to May 1, 2015\n- CA messaging/application revised to wattsmart Business\n- CA incentive rate revised to $0.15/kWh for projects completed on or after May 1, 2015 (Previous projects paid at $0.12/kWh + $50/kW)\n- Version # revised, beta version for testing, release version to be 050115.1\n","Jake DeMann"," 010115.1","beta 050115"]
["2015-05-21","Finalize following QC comments - No comments required changes","Joe Larsen","beta 050115","050115.1"]
["2015-09-22","Corrected rate schedule data validation","Jake DeMann","050115.1","050115.2"]
["2016-07-07","Updated rates, using Rates for Software 6-17-2016","Jake DeMann","050115.2","071115.1"]
["2018-03-15","Functional corrections","Jake DeMann","071115.1","071116.2"]
["2018-12-26","Update rates for WA, UT, WY","Van Le",71116.2,122618]
["2019-02-07","Revise rates for WA and UT","Van Le",122618,122618.1]
["2020-08-20","Updated incentives for WA. Updated how incentives and tariff dates are recorded in new table on \"Chiller Calculations\" tab","Drew Petersen",122618.1,80120.100000000006]
["2024-07-31","Updated Code making current code for UT IECC 2021, current code for WA WSEC 2021, and Idaho IECC 2018. Removed CA from the state selection as it no longer uses calculator for chiller measures","Joe Larsen",80120.100000000006,"073124.1","a"]